Test results
1 suite, 65 failed tests
org.fcrepo.spec.testsuite.versioning.LdprvHttpGet
ldpvGetMustReturnOriginalResourceLink
java.lang.AssertionError: Link header with a value of <http://mementoweb.org/ns#OriginalResource>; rel="type" must be present but is not! expected [1] but found [0] at org.fcrepo.spec.testsuite.AbstractTest.confirmPresenceOfLinkValue(AbstractTest.java:561) at org.fcrepo.spec.testsuite.AbstractTest.confirmPresenceOfLinkValue(AbstractTest.java:557) at org.fcrepo.spec.testsuite.versioning.LdprvHttpGet.ldpvGetMustReturnOriginalResourceLink(LdprvHttpGet.java:168) at org.fcrepo.spec.testsuite.App.main(App.java:309) ... Removed 27 stack frames
ldpvGetMustReturnTimeGateTypeLink
java.lang.AssertionError: Link header with a value of <http://mementoweb.org/ns#TimeGate>; rel="type" must be present but is not! expected [1] but found [0] at org.fcrepo.spec.testsuite.AbstractTest.confirmPresenceOfLinkValue(AbstractTest.java:561) at org.fcrepo.spec.testsuite.AbstractTest.confirmPresenceOfLinkValue(AbstractTest.java:557) at org.fcrepo.spec.testsuite.versioning.LdprvHttpGet.ldpvGetMustReturnTimeGateTypeLink(LdprvHttpGet.java:186) at org.fcrepo.spec.testsuite.App.main(App.java:309) ... Removed 27 stack frames
shouldReturn302WhenLdprmFromTimeGate
java.lang.AssertionError: expected [http://0.0.0.0:8080/testsuitecontainer09102019101459/f6124869-61a9-476a-b020-69c74d1fe131?version=0] but found [http://0.0.0.0:8080/testsuitecontainer09102019101459/f6124869-61a9-476a-b020-69c74d1fe131?version=1568124913] at org.fcrepo.spec.testsuite.versioning.LdprvHttpGet.shouldReturn302WhenLdprmFromTimeGate(LdprvHttpGet.java:114) at org.fcrepo.spec.testsuite.App.main(App.java:309) ... Removed 28 stack frames
org.fcrepo.spec.testsuite.crud.HttpGet
respondWantDigestMd5
java.lang.AssertionError: 1 expectation failed. Expected header "Digest" was not a string containing "md5", was "null". Headers are: Accept-Patch=application/sparql-update Accept-Ranges=bytes Date=Tue, 10 Sep 2019 14:15:02 GMT Allow=GET,HEAD,OPTIONS,PUT,DELETE Connection=keep-alive ETag="7af0be861460b0081e635a0e79adf407" Last-Modified=Tue, 10 Sep 2019 14:15:02 GMT Vary=Accept Vary=Accept-Datetime Vary=Range Content-Type=text/plain;charset=ISO-8859-1 Content-Length=10 Link=<http://www.w3.org/ns/ldp#NonRDFSource>; rel="type" Link=<http://www.w3.org/ns/ldp#Resource>; rel="type" Link=<http://0.0.0.0:8080/testsuitecontainer09102019101459/3.2.3-A-1>; rel="original timegate" Link=<http://0.0.0.0:8080/testsuitecontainer09102019101459/3.2.3-A-1?ext=timemap>; rel="timemap"; from="Tue, 10 Sep 2019 14:15:02 GMT"; until="Tue, 10 Sep 2019 14:15:02 GMT"; type="application/link-format" Link=<http://0.0.0.0:8080/testsuitecontainer09102019101459/3.2.3-A-1?version=1568124902>; rel="first last memento"; datetime="Tue, 10 Sep 2019 14:15:02 GMT" Link=<http://0.0.0.0:8080/testsuitecontainer09102019101459/3.2.3-A-1>; rel="canonical" Link=<http://0.0.0.0:8080/testsuitecontainer09102019101459/3.2.3-A-1?ext=description>; rel="describedby" Link=<http://0.0.0.0:8080/testsuitecontainer09102019101459/3.2.3-A-1>; rel="self" Link=<http://0.0.0.0:8080/testsuitecontainer09102019101459/3.2.3-A-1?ext=acl>; rel="acl" at org.codehaus.groovy.runtime.callsite.ConstructorSite$ConstructorSiteNoUnwrap.callConstructor(ConstructorSite.java:84) at org.codehaus.groovy.runtime.callsite.CallSiteArray.defaultCallConstructor(CallSiteArray.java:60) at org.codehaus.groovy.runtime.callsite.AbstractCallSite.callConstructor(AbstractCallSite.java:235) at org.codehaus.groovy.runtime.callsite.AbstractCallSite.callConstructor(AbstractCallSite.java:247) at io.restassured.internal.ResponseSpecificationImpl$HamcrestAssertionClosure.validate(ResponseSpecificationImpl.groovy:483) at io.restassured.internal.ResponseSpecificationImpl$HamcrestAssertionClosure$validate$1.call(Unknown Source) at io.restassured.internal.ResponseSpecificationImpl.validateResponseIfRequired(ResponseSpecificationImpl.groovy:655) at org.codehaus.groovy.runtime.callsite.PogoMetaMethodSite$PogoCachedMethodSiteNoUnwrapNoCoerce.invoke(PogoMetaMethodSite.java:210) at org.codehaus.groovy.runtime.callsite.PogoMetaMethodSite.callCurrent(PogoMetaMethodSite.java:59) at org.codehaus.groovy.runtime.callsite.CallSiteArray.defaultCallCurrent(CallSiteArray.java:52) at org.codehaus.groovy.runtime.callsite.AbstractCallSite.callCurrent(AbstractCallSite.java:154) at org.codehaus.groovy.runtime.callsite.AbstractCallSite.callCurrent(AbstractCallSite.java:166) at io.restassured.internal.ResponseSpecificationImpl.header(ResponseSpecificationImpl.groovy:178) at io.restassured.internal.ValidatableResponseOptionsImpl.header(ValidatableResponseOptionsImpl.java:144) at org.fcrepo.spec.testsuite.crud.HttpGet.respondWantDigestMd5(HttpGet.java:190) at org.fcrepo.spec.testsuite.App.main(App.java:309) ... Removed 32 stack frames
respondWantDigestNonSupported
java.lang.AssertionError: 1 expectation failed. Expected status code <400> but was <200>. at org.codehaus.groovy.runtime.callsite.ConstructorSite$ConstructorSiteNoUnwrap.callConstructor(ConstructorSite.java:84) at org.codehaus.groovy.runtime.callsite.AbstractCallSite.callConstructor(AbstractCallSite.java:247) at io.restassured.internal.ResponseSpecificationImpl$HamcrestAssertionClosure.validate(ResponseSpecificationImpl.groovy:483) at io.restassured.internal.ResponseSpecificationImpl$HamcrestAssertionClosure$validate$1.call(Unknown Source) at io.restassured.internal.ResponseSpecificationImpl.validateResponseIfRequired(ResponseSpecificationImpl.groovy:655) at org.codehaus.groovy.runtime.callsite.PogoMetaMethodSite$PogoCachedMethodSiteNoUnwrapNoCoerce.invoke(PogoMetaMethodSite.java:210) at org.codehaus.groovy.runtime.callsite.PogoMetaMethodSite.callCurrent(PogoMetaMethodSite.java:59) at org.codehaus.groovy.runtime.callsite.AbstractCallSite.callCurrent(AbstractCallSite.java:166) at io.restassured.internal.ResponseSpecificationImpl.statusCode(ResponseSpecificationImpl.groovy:123) at io.restassured.specification.ResponseSpecification$statusCode$0.callCurrent(Unknown Source) at io.restassured.internal.ResponseSpecificationImpl.statusCode(ResponseSpecificationImpl.groovy:131) at io.restassured.internal.ValidatableResponseOptionsImpl.statusCode(ValidatableResponseOptionsImpl.java:119) at org.fcrepo.spec.testsuite.crud.HttpGet.respondWantDigestNonSupported(HttpGet.java:372) at org.fcrepo.spec.testsuite.App.main(App.java:309) ... Removed 31 stack frames
respondWantDigestNonSupportedWithSupported
java.lang.AssertionError: 1 expectation failed. Expected header "Digest" was not a string containing "md5", was "null". Headers are: Accept-Patch=application/sparql-update Accept-Ranges=bytes Date=Tue, 10 Sep 2019 14:15:02 GMT Allow=GET,HEAD,OPTIONS,PUT,DELETE Connection=keep-alive ETag="2f09419e19a1586b10816baecce040fc" Last-Modified=Tue, 10 Sep 2019 14:15:02 GMT Vary=Accept Vary=Accept-Datetime Vary=Range Content-Type=text/plain;charset=ISO-8859-1 Content-Length=10 Link=<http://www.w3.org/ns/ldp#NonRDFSource>; rel="type" Link=<http://www.w3.org/ns/ldp#Resource>; rel="type" Link=<http://0.0.0.0:8080/testsuitecontainer09102019101459/3.2.3-E>; rel="original timegate" Link=<http://0.0.0.0:8080/testsuitecontainer09102019101459/3.2.3-E?ext=timemap>; rel="timemap"; from="Tue, 10 Sep 2019 14:15:02 GMT"; until="Tue, 10 Sep 2019 14:15:02 GMT"; type="application/link-format" Link=<http://0.0.0.0:8080/testsuitecontainer09102019101459/3.2.3-E?version=1568124902>; rel="first last memento"; datetime="Tue, 10 Sep 2019 14:15:02 GMT" Link=<http://0.0.0.0:8080/testsuitecontainer09102019101459/3.2.3-E>; rel="canonical" Link=<http://0.0.0.0:8080/testsuitecontainer09102019101459/3.2.3-E?ext=description>; rel="describedby" Link=<http://0.0.0.0:8080/testsuitecontainer09102019101459/3.2.3-E>; rel="self" Link=<http://0.0.0.0:8080/testsuitecontainer09102019101459/3.2.3-E?ext=acl>; rel="acl" at org.codehaus.groovy.runtime.callsite.ConstructorSite$ConstructorSiteNoUnwrap.callConstructor(ConstructorSite.java:84) at org.codehaus.groovy.runtime.callsite.AbstractCallSite.callConstructor(AbstractCallSite.java:247) at io.restassured.internal.ResponseSpecificationImpl$HamcrestAssertionClosure.validate(ResponseSpecificationImpl.groovy:483) at io.restassured.internal.ResponseSpecificationImpl$HamcrestAssertionClosure$validate$1.call(Unknown Source) at io.restassured.internal.ResponseSpecificationImpl.validateResponseIfRequired(ResponseSpecificationImpl.groovy:655) at org.codehaus.groovy.runtime.callsite.PogoMetaMethodSite$PogoCachedMethodSiteNoUnwrapNoCoerce.invoke(PogoMetaMethodSite.java:210) at org.codehaus.groovy.runtime.callsite.PogoMetaMethodSite.callCurrent(PogoMetaMethodSite.java:59) at org.codehaus.groovy.runtime.callsite.AbstractCallSite.callCurrent(AbstractCallSite.java:166) at io.restassured.internal.ResponseSpecificationImpl.header(ResponseSpecificationImpl.groovy:178) at io.restassured.internal.ValidatableResponseOptionsImpl.header(ValidatableResponseOptionsImpl.java:144) at org.fcrepo.spec.testsuite.crud.HttpGet.respondWantDigestNonSupportedWithSupported(HttpGet.java:349) at org.fcrepo.spec.testsuite.App.main(App.java:309) ... Removed 31 stack frames
respondWantDigestSha1
java.lang.AssertionError: 1 expectation failed. Expected header "Digest" was not a string containing "sha", was "null". Headers are: Accept-Patch=application/sparql-update Accept-Ranges=bytes Date=Tue, 10 Sep 2019 14:15:03 GMT Allow=GET,HEAD,OPTIONS,PUT,DELETE Connection=keep-alive ETag="f2fc34fcb5efa4eb595eb567872750d5" Last-Modified=Tue, 10 Sep 2019 14:15:02 GMT Vary=Accept Vary=Accept-Datetime Vary=Range Content-Type=text/plain;charset=ISO-8859-1 Content-Length=10 Link=<http://www.w3.org/ns/ldp#NonRDFSource>; rel="type" Link=<http://www.w3.org/ns/ldp#Resource>; rel="type" Link=<http://0.0.0.0:8080/testsuitecontainer09102019101459/3.2.3-A-2>; rel="original timegate" Link=<http://0.0.0.0:8080/testsuitecontainer09102019101459/3.2.3-A-2?ext=timemap>; rel="timemap"; from="Tue, 10 Sep 2019 14:15:02 GMT"; until="Tue, 10 Sep 2019 14:15:02 GMT"; type="application/link-format" Link=<http://0.0.0.0:8080/testsuitecontainer09102019101459/3.2.3-A-2?version=1568124902>; rel="first last memento"; datetime="Tue, 10 Sep 2019 14:15:02 GMT" Link=<http://0.0.0.0:8080/testsuitecontainer09102019101459/3.2.3-A-2>; rel="canonical" Link=<http://0.0.0.0:8080/testsuitecontainer09102019101459/3.2.3-A-2?ext=description>; rel="describedby" Link=<http://0.0.0.0:8080/testsuitecontainer09102019101459/3.2.3-A-2>; rel="self" Link=<http://0.0.0.0:8080/testsuitecontainer09102019101459/3.2.3-A-2?ext=acl>; rel="acl" at org.codehaus.groovy.runtime.callsite.ConstructorSite$ConstructorSiteNoUnwrap.callConstructor(ConstructorSite.java:84) at org.codehaus.groovy.runtime.callsite.AbstractCallSite.callConstructor(AbstractCallSite.java:247) at io.restassured.internal.ResponseSpecificationImpl$HamcrestAssertionClosure.validate(ResponseSpecificationImpl.groovy:483) at io.restassured.internal.ResponseSpecificationImpl$HamcrestAssertionClosure$validate$1.call(Unknown Source) at io.restassured.internal.ResponseSpecificationImpl.validateResponseIfRequired(ResponseSpecificationImpl.groovy:655) at org.codehaus.groovy.runtime.callsite.PogoMetaMethodSite$PogoCachedMethodSiteNoUnwrapNoCoerce.invoke(PogoMetaMethodSite.java:210) at org.codehaus.groovy.runtime.callsite.PogoMetaMethodSite.callCurrent(PogoMetaMethodSite.java:59) at org.codehaus.groovy.runtime.callsite.AbstractCallSite.callCurrent(AbstractCallSite.java:166) at io.restassured.internal.ResponseSpecificationImpl.header(ResponseSpecificationImpl.groovy:178) at io.restassured.internal.ValidatableResponseOptionsImpl.header(ValidatableResponseOptionsImpl.java:144) at org.fcrepo.spec.testsuite.crud.HttpGet.respondWantDigestSha1(HttpGet.java:214) at org.fcrepo.spec.testsuite.App.main(App.java:309) ... Removed 31 stack frames
respondWantDigestSha256
java.lang.AssertionError: 1 expectation failed. Expected header "Digest" was not a string containing "sha-256", was "null". Headers are: Accept-Patch=application/sparql-update Accept-Ranges=bytes Date=Tue, 10 Sep 2019 14:15:03 GMT Allow=GET,HEAD,OPTIONS,PUT,DELETE Connection=keep-alive ETag="23d2acc1b44cdef22cdff916d58129b8" Last-Modified=Tue, 10 Sep 2019 14:15:03 GMT Vary=Accept Vary=Accept-Datetime Vary=Range Content-Type=text/plain;charset=ISO-8859-1 Content-Length=10 Link=<http://www.w3.org/ns/ldp#NonRDFSource>; rel="type" Link=<http://www.w3.org/ns/ldp#Resource>; rel="type" Link=<http://0.0.0.0:8080/testsuitecontainer09102019101459/3.2.3-A-3>; rel="original timegate" Link=<http://0.0.0.0:8080/testsuitecontainer09102019101459/3.2.3-A-3?ext=timemap>; rel="timemap"; from="Tue, 10 Sep 2019 14:15:03 GMT"; until="Tue, 10 Sep 2019 14:15:03 GMT"; type="application/link-format" Link=<http://0.0.0.0:8080/testsuitecontainer09102019101459/3.2.3-A-3?version=1568124903>; rel="first last memento"; datetime="Tue, 10 Sep 2019 14:15:03 GMT" Link=<http://0.0.0.0:8080/testsuitecontainer09102019101459/3.2.3-A-3>; rel="canonical" Link=<http://0.0.0.0:8080/testsuitecontainer09102019101459/3.2.3-A-3?ext=description>; rel="describedby" Link=<http://0.0.0.0:8080/testsuitecontainer09102019101459/3.2.3-A-3>; rel="self" Link=<http://0.0.0.0:8080/testsuitecontainer09102019101459/3.2.3-A-3?ext=acl>; rel="acl" at org.codehaus.groovy.runtime.callsite.ConstructorSite$ConstructorSiteNoUnwrap.callConstructor(ConstructorSite.java:84) at org.codehaus.groovy.runtime.callsite.AbstractCallSite.callConstructor(AbstractCallSite.java:247) at io.restassured.internal.ResponseSpecificationImpl$HamcrestAssertionClosure.validate(ResponseSpecificationImpl.groovy:483) at io.restassured.internal.ResponseSpecificationImpl$HamcrestAssertionClosure$validate$1.call(Unknown Source) at io.restassured.internal.ResponseSpecificationImpl.validateResponseIfRequired(ResponseSpecificationImpl.groovy:655) at org.codehaus.groovy.runtime.callsite.PogoMetaMethodSite$PogoCachedMethodSiteNoUnwrapNoCoerce.invoke(PogoMetaMethodSite.java:210) at org.codehaus.groovy.runtime.callsite.PogoMetaMethodSite.callCurrent(PogoMetaMethodSite.java:59) at org.codehaus.groovy.runtime.callsite.AbstractCallSite.callCurrent(AbstractCallSite.java:166) at io.restassured.internal.ResponseSpecificationImpl.header(ResponseSpecificationImpl.groovy:178) at io.restassured.internal.ValidatableResponseOptionsImpl.header(ValidatableResponseOptionsImpl.java:144) at org.fcrepo.spec.testsuite.crud.HttpGet.respondWantDigestSha256(HttpGet.java:238) at org.fcrepo.spec.testsuite.App.main(App.java:309) ... Removed 31 stack frames
respondWantDigestTwoSupported
java.lang.NullPointerException at org.fcrepo.spec.testsuite.crud.HttpGet.respondWantDigestTwoSupported(HttpGet.java:269) at org.fcrepo.spec.testsuite.App.main(App.java:309) ... Removed 22 stack frames
respondWantDigestTwoSupportedQvalueNonZero
java.lang.NullPointerException at org.fcrepo.spec.testsuite.crud.HttpGet.respondWantDigestTwoSupportedQvalueNonZero(HttpGet.java:302) at org.fcrepo.spec.testsuite.App.main(App.java:309) ... Removed 22 stack frames
respondWantDigestTwoSupportedQvalueZero
java.lang.AssertionError: 1 expectation failed. Expected header "Digest" was not a string containing "md5", was "null". Headers are: Accept-Patch=application/sparql-update Accept-Ranges=bytes Date=Tue, 10 Sep 2019 14:15:03 GMT Allow=GET,HEAD,OPTIONS,PUT,DELETE Connection=keep-alive ETag="4f9d8db177a05d50565598aa0df56aa2" Last-Modified=Tue, 10 Sep 2019 14:15:03 GMT Vary=Accept Vary=Accept-Datetime Vary=Range Content-Type=text/plain;charset=ISO-8859-1 Content-Length=10 Link=<http://www.w3.org/ns/ldp#NonRDFSource>; rel="type" Link=<http://www.w3.org/ns/ldp#Resource>; rel="type" Link=<http://0.0.0.0:8080/testsuitecontainer09102019101459/3.2.3-D>; rel="original timegate" Link=<http://0.0.0.0:8080/testsuitecontainer09102019101459/3.2.3-D?ext=timemap>; rel="timemap"; from="Tue, 10 Sep 2019 14:15:03 GMT"; until="Tue, 10 Sep 2019 14:15:03 GMT"; type="application/link-format" Link=<http://0.0.0.0:8080/testsuitecontainer09102019101459/3.2.3-D?version=1568124903>; rel="first last memento"; datetime="Tue, 10 Sep 2019 14:15:03 GMT" Link=<http://0.0.0.0:8080/testsuitecontainer09102019101459/3.2.3-D>; rel="canonical" Link=<http://0.0.0.0:8080/testsuitecontainer09102019101459/3.2.3-D?ext=description>; rel="describedby" Link=<http://0.0.0.0:8080/testsuitecontainer09102019101459/3.2.3-D>; rel="self" Link=<http://0.0.0.0:8080/testsuitecontainer09102019101459/3.2.3-D?ext=acl>; rel="acl" at org.codehaus.groovy.runtime.callsite.ConstructorSite$ConstructorSiteNoUnwrap.callConstructor(ConstructorSite.java:84) at org.codehaus.groovy.runtime.callsite.AbstractCallSite.callConstructor(AbstractCallSite.java:247) at io.restassured.internal.ResponseSpecificationImpl$HamcrestAssertionClosure.validate(ResponseSpecificationImpl.groovy:483) at io.restassured.internal.ResponseSpecificationImpl$HamcrestAssertionClosure$validate$1.call(Unknown Source) at io.restassured.internal.ResponseSpecificationImpl.validateResponseIfRequired(ResponseSpecificationImpl.groovy:655) at org.codehaus.groovy.runtime.callsite.PogoMetaMethodSite$PogoCachedMethodSiteNoUnwrapNoCoerce.invoke(PogoMetaMethodSite.java:210) at org.codehaus.groovy.runtime.callsite.PogoMetaMethodSite.callCurrent(PogoMetaMethodSite.java:59) at org.codehaus.groovy.runtime.callsite.AbstractCallSite.callCurrent(AbstractCallSite.java:166) at io.restassured.internal.ResponseSpecificationImpl.header(ResponseSpecificationImpl.groovy:178) at io.restassured.internal.ValidatableResponseOptionsImpl.header(ValidatableResponseOptionsImpl.java:144) at org.fcrepo.spec.testsuite.crud.HttpGet.respondWantDigestTwoSupportedQvalueZero(HttpGet.java:326) at org.fcrepo.spec.testsuite.App.main(App.java:309) ... Removed 31 stack frames
org.fcrepo.spec.testsuite.authz.WebACRepresentation
aclExamined
java.lang.AssertionError: 1 expectation failed. Expected status code <200> but was <403>. at org.codehaus.groovy.runtime.callsite.ConstructorSite$ConstructorSiteNoUnwrap.callConstructor(ConstructorSite.java:84) at org.codehaus.groovy.runtime.callsite.AbstractCallSite.callConstructor(AbstractCallSite.java:247) at io.restassured.internal.ResponseSpecificationImpl$HamcrestAssertionClosure.validate(ResponseSpecificationImpl.groovy:483) at io.restassured.internal.ResponseSpecificationImpl$HamcrestAssertionClosure$validate$1.call(Unknown Source) at io.restassured.internal.ResponseSpecificationImpl.validateResponseIfRequired(ResponseSpecificationImpl.groovy:655) at org.codehaus.groovy.runtime.callsite.PogoMetaMethodSite$PogoCachedMethodSiteNoUnwrapNoCoerce.invoke(PogoMetaMethodSite.java:210) at org.codehaus.groovy.runtime.callsite.PogoMetaMethodSite.callCurrent(PogoMetaMethodSite.java:59) at org.codehaus.groovy.runtime.callsite.AbstractCallSite.callCurrent(AbstractCallSite.java:166) at io.restassured.internal.ResponseSpecificationImpl.statusCode(ResponseSpecificationImpl.groovy:123) at io.restassured.specification.ResponseSpecification$statusCode$0.callCurrent(Unknown Source) at io.restassured.internal.ResponseSpecificationImpl.statusCode(ResponseSpecificationImpl.groovy:131) at io.restassured.internal.ValidatableResponseOptionsImpl.statusCode(ValidatableResponseOptionsImpl.java:119) at org.fcrepo.spec.testsuite.AbstractTest.doGet(AbstractTest.java:390) at org.fcrepo.spec.testsuite.authz.WebACRepresentation.aclExamined(WebACRepresentation.java:121) at org.fcrepo.spec.testsuite.App.main(App.java:309) ... Removed 30 stack frames
aclRepresentation
java.lang.AssertionError: 1 expectation failed. Expected status code <200> but was <403>. at org.codehaus.groovy.runtime.callsite.ConstructorSite$ConstructorSiteNoUnwrap.callConstructor(ConstructorSite.java:84) at org.codehaus.groovy.runtime.callsite.AbstractCallSite.callConstructor(AbstractCallSite.java:247) at io.restassured.internal.ResponseSpecificationImpl$HamcrestAssertionClosure.validate(ResponseSpecificationImpl.groovy:483) at io.restassured.internal.ResponseSpecificationImpl$HamcrestAssertionClosure$validate$1.call(Unknown Source) at io.restassured.internal.ResponseSpecificationImpl.validateResponseIfRequired(ResponseSpecificationImpl.groovy:655) at org.codehaus.groovy.runtime.callsite.PogoMetaMethodSite$PogoCachedMethodSiteNoUnwrapNoCoerce.invoke(PogoMetaMethodSite.java:210) at org.codehaus.groovy.runtime.callsite.PogoMetaMethodSite.callCurrent(PogoMetaMethodSite.java:59) at org.codehaus.groovy.runtime.callsite.AbstractCallSite.callCurrent(AbstractCallSite.java:166) at io.restassured.internal.ResponseSpecificationImpl.statusCode(ResponseSpecificationImpl.groovy:123) at io.restassured.specification.ResponseSpecification$statusCode$0.callCurrent(Unknown Source) at io.restassured.internal.ResponseSpecificationImpl.statusCode(ResponseSpecificationImpl.groovy:131) at io.restassured.internal.ValidatableResponseOptionsImpl.statusCode(ValidatableResponseOptionsImpl.java:119) at org.fcrepo.spec.testsuite.AbstractTest.doGet(AbstractTest.java:390) at org.fcrepo.spec.testsuite.authz.WebACRepresentation.aclRepresentation(WebACRepresentation.java:51) at org.fcrepo.spec.testsuite.App.main(App.java:309) ... Removed 30 stack frames
dereferencingGroups
java.lang.AssertionError: 1 expectation failed. Expected status code <200> but was <403>. at org.codehaus.groovy.runtime.callsite.ConstructorSite$ConstructorSiteNoUnwrap.callConstructor(ConstructorSite.java:84) at org.codehaus.groovy.runtime.callsite.AbstractCallSite.callConstructor(AbstractCallSite.java:247) at io.restassured.internal.ResponseSpecificationImpl$HamcrestAssertionClosure.validate(ResponseSpecificationImpl.groovy:483) at io.restassured.internal.ResponseSpecificationImpl$HamcrestAssertionClosure$validate$1.call(Unknown Source) at io.restassured.internal.ResponseSpecificationImpl.validateResponseIfRequired(ResponseSpecificationImpl.groovy:655) at org.codehaus.groovy.runtime.callsite.PogoMetaMethodSite$PogoCachedMethodSiteNoUnwrapNoCoerce.invoke(PogoMetaMethodSite.java:210) at org.codehaus.groovy.runtime.callsite.PogoMetaMethodSite.callCurrent(PogoMetaMethodSite.java:59) at org.codehaus.groovy.runtime.callsite.AbstractCallSite.callCurrent(AbstractCallSite.java:166) at io.restassured.internal.ResponseSpecificationImpl.statusCode(ResponseSpecificationImpl.groovy:123) at io.restassured.specification.ResponseSpecification$statusCode$0.callCurrent(Unknown Source) at io.restassured.internal.ResponseSpecificationImpl.statusCode(ResponseSpecificationImpl.groovy:131) at io.restassured.internal.ValidatableResponseOptionsImpl.statusCode(ValidatableResponseOptionsImpl.java:119) at org.fcrepo.spec.testsuite.AbstractTest.doGet(AbstractTest.java:390) at org.fcrepo.spec.testsuite.authz.WebACRepresentation.dereferencingGroups(WebACRepresentation.java:104) at org.fcrepo.spec.testsuite.App.main(App.java:309) ... Removed 30 stack frames
org.fcrepo.spec.testsuite.authz.WebACModes
appendAllowedPATCH
java.lang.AssertionError: 1 expectation failed. Expected status code (a value equal to or greater than <200> and a value less than <300>) but a value less than <300> <403> was greater than <300>. at org.codehaus.groovy.runtime.callsite.ConstructorSite$ConstructorSiteNoUnwrap.callConstructor(ConstructorSite.java:84) at org.codehaus.groovy.runtime.callsite.AbstractCallSite.callConstructor(AbstractCallSite.java:247) at io.restassured.internal.ResponseSpecificationImpl$HamcrestAssertionClosure.validate(ResponseSpecificationImpl.groovy:483) at io.restassured.internal.ResponseSpecificationImpl$HamcrestAssertionClosure$validate$1.call(Unknown Source) at io.restassured.internal.ResponseSpecificationImpl.validateResponseIfRequired(ResponseSpecificationImpl.groovy:655) at org.codehaus.groovy.runtime.callsite.PogoMetaMethodSite$PogoCachedMethodSiteNoUnwrapNoCoerce.invoke(PogoMetaMethodSite.java:210) at org.codehaus.groovy.runtime.callsite.PogoMetaMethodSite.callCurrent(PogoMetaMethodSite.java:59) at org.codehaus.groovy.runtime.callsite.AbstractCallSite.callCurrent(AbstractCallSite.java:166) at io.restassured.internal.ResponseSpecificationImpl.statusCode(ResponseSpecificationImpl.groovy:123) at io.restassured.internal.ValidatableResponseOptionsImpl.statusCode(ValidatableResponseOptionsImpl.java:114) at org.fcrepo.spec.testsuite.AbstractTest.doPatch(AbstractTest.java:450) at org.fcrepo.spec.testsuite.authz.WebACModes.appendAllowedPATCH(WebACModes.java:296) at org.fcrepo.spec.testsuite.App.main(App.java:309) ... Removed 31 stack frames
appendAllowedPOST
java.lang.AssertionError: 1 expectation failed. Expected status code <201> but was <403>. at org.codehaus.groovy.runtime.callsite.ConstructorSite$ConstructorSiteNoUnwrap.callConstructor(ConstructorSite.java:84) at org.codehaus.groovy.runtime.callsite.AbstractCallSite.callConstructor(AbstractCallSite.java:247) at io.restassured.internal.ResponseSpecificationImpl$HamcrestAssertionClosure.validate(ResponseSpecificationImpl.groovy:483) at io.restassured.internal.ResponseSpecificationImpl$HamcrestAssertionClosure$validate$1.call(Unknown Source) at io.restassured.internal.ResponseSpecificationImpl.validateResponseIfRequired(ResponseSpecificationImpl.groovy:655) at org.codehaus.groovy.runtime.callsite.PogoMetaMethodSite$PogoCachedMethodSiteNoUnwrapNoCoerce.invoke(PogoMetaMethodSite.java:210) at org.codehaus.groovy.runtime.callsite.PogoMetaMethodSite.callCurrent(PogoMetaMethodSite.java:59) at org.codehaus.groovy.runtime.callsite.AbstractCallSite.callCurrent(AbstractCallSite.java:166) at io.restassured.internal.ResponseSpecificationImpl.statusCode(ResponseSpecificationImpl.groovy:123) at io.restassured.specification.ResponseSpecification$statusCode$0.callCurrent(Unknown Source) at io.restassured.internal.ResponseSpecificationImpl.statusCode(ResponseSpecificationImpl.groovy:131) at io.restassured.internal.ValidatableResponseOptionsImpl.statusCode(ValidatableResponseOptionsImpl.java:119) at org.fcrepo.spec.testsuite.AbstractTest.doPost(AbstractTest.java:272) at org.fcrepo.spec.testsuite.authz.WebACModes.appendAllowedPOST(WebACModes.java:272) at org.fcrepo.spec.testsuite.App.main(App.java:309) ... Removed 31 stack frames
appendNotWriteLdpCMust
java.lang.AssertionError: 1 expectation failed. Expected status code <200> but was <403>. at org.codehaus.groovy.runtime.callsite.ConstructorSite$ConstructorSiteNoUnwrap.callConstructor(ConstructorSite.java:84) at org.codehaus.groovy.runtime.callsite.AbstractCallSite.callConstructor(AbstractCallSite.java:247) at io.restassured.internal.ResponseSpecificationImpl$HamcrestAssertionClosure.validate(ResponseSpecificationImpl.groovy:483) at io.restassured.internal.ResponseSpecificationImpl$HamcrestAssertionClosure$validate$1.call(Unknown Source) at io.restassured.internal.ResponseSpecificationImpl.validateResponseIfRequired(ResponseSpecificationImpl.groovy:655) at org.codehaus.groovy.runtime.callsite.PogoMetaMethodSite$PogoCachedMethodSiteNoUnwrapNoCoerce.invoke(PogoMetaMethodSite.java:210) at org.codehaus.groovy.runtime.callsite.PogoMetaMethodSite.callCurrent(PogoMetaMethodSite.java:59) at org.codehaus.groovy.runtime.callsite.AbstractCallSite.callCurrent(AbstractCallSite.java:166) at io.restassured.internal.ResponseSpecificationImpl.statusCode(ResponseSpecificationImpl.groovy:123) at io.restassured.specification.ResponseSpecification$statusCode$0.callCurrent(Unknown Source) at io.restassured.internal.ResponseSpecificationImpl.statusCode(ResponseSpecificationImpl.groovy:131) at io.restassured.internal.ValidatableResponseOptionsImpl.statusCode(ValidatableResponseOptionsImpl.java:119) at org.fcrepo.spec.testsuite.AbstractTest.doGet(AbstractTest.java:390) at org.fcrepo.spec.testsuite.authz.WebACModes.appendNotWriteLdpCMust(WebACModes.java:586) at org.fcrepo.spec.testsuite.App.main(App.java:309) ... Removed 31 stack frames
appendNotWritePutToCreate
java.lang.AssertionError: 1 expectation failed. Expected status code <201> but was <403>. at org.codehaus.groovy.runtime.callsite.ConstructorSite$ConstructorSiteNoUnwrap.callConstructor(ConstructorSite.java:84) at org.codehaus.groovy.runtime.callsite.AbstractCallSite.callConstructor(AbstractCallSite.java:247) at io.restassured.internal.ResponseSpecificationImpl$HamcrestAssertionClosure.validate(ResponseSpecificationImpl.groovy:483) at io.restassured.internal.ResponseSpecificationImpl$HamcrestAssertionClosure$validate$1.call(Unknown Source) at io.restassured.internal.ResponseSpecificationImpl.validateResponseIfRequired(ResponseSpecificationImpl.groovy:655) at org.codehaus.groovy.runtime.callsite.PogoMetaMethodSite$PogoCachedMethodSiteNoUnwrapNoCoerce.invoke(PogoMetaMethodSite.java:210) at org.codehaus.groovy.runtime.callsite.PogoMetaMethodSite.callCurrent(PogoMetaMethodSite.java:59) at org.codehaus.groovy.runtime.callsite.AbstractCallSite.callCurrent(AbstractCallSite.java:166) at io.restassured.internal.ResponseSpecificationImpl.statusCode(ResponseSpecificationImpl.groovy:123) at io.restassured.specification.ResponseSpecification$statusCode$0.callCurrent(Unknown Source) at io.restassured.internal.ResponseSpecificationImpl.statusCode(ResponseSpecificationImpl.groovy:131) at io.restassured.internal.ValidatableResponseOptionsImpl.statusCode(ValidatableResponseOptionsImpl.java:119) at org.fcrepo.spec.testsuite.authz.WebACModes.appendNotWritePutToCreate(WebACModes.java:539) at org.fcrepo.spec.testsuite.App.main(App.java:309) ... Removed 31 stack frames
controlAllowedGET
java.lang.AssertionError: 1 expectation failed. Expected status code <200> but was <403>. at org.codehaus.groovy.runtime.callsite.ConstructorSite$ConstructorSiteNoUnwrap.callConstructor(ConstructorSite.java:84) at org.codehaus.groovy.runtime.callsite.AbstractCallSite.callConstructor(AbstractCallSite.java:247) at io.restassured.internal.ResponseSpecificationImpl$HamcrestAssertionClosure.validate(ResponseSpecificationImpl.groovy:483) at io.restassured.internal.ResponseSpecificationImpl$HamcrestAssertionClosure$validate$1.call(Unknown Source) at io.restassured.internal.ResponseSpecificationImpl.validateResponseIfRequired(ResponseSpecificationImpl.groovy:655) at org.codehaus.groovy.runtime.callsite.PogoMetaMethodSite$PogoCachedMethodSiteNoUnwrapNoCoerce.invoke(PogoMetaMethodSite.java:210) at org.codehaus.groovy.runtime.callsite.PogoMetaMethodSite.callCurrent(PogoMetaMethodSite.java:59) at org.codehaus.groovy.runtime.callsite.AbstractCallSite.callCurrent(AbstractCallSite.java:166) at io.restassured.internal.ResponseSpecificationImpl.statusCode(ResponseSpecificationImpl.groovy:123) at io.restassured.specification.ResponseSpecification$statusCode$0.callCurrent(Unknown Source) at io.restassured.internal.ResponseSpecificationImpl.statusCode(ResponseSpecificationImpl.groovy:131) at io.restassured.internal.ValidatableResponseOptionsImpl.statusCode(ValidatableResponseOptionsImpl.java:119) at org.fcrepo.spec.testsuite.AbstractTest.doGet(AbstractTest.java:390) at org.fcrepo.spec.testsuite.authz.WebACModes.controlAllowedGET(WebACModes.java:341) at org.fcrepo.spec.testsuite.App.main(App.java:309) ... Removed 31 stack frames
controlAllowedPATCH
java.lang.AssertionError: 1 expectation failed. Expected status code (a value equal to or greater than <200> and a value less than <300>) but a value less than <300> <403> was greater than <300>. at org.codehaus.groovy.runtime.callsite.ConstructorSite$ConstructorSiteNoUnwrap.callConstructor(ConstructorSite.java:84) at org.codehaus.groovy.runtime.callsite.AbstractCallSite.callConstructor(AbstractCallSite.java:247) at io.restassured.internal.ResponseSpecificationImpl$HamcrestAssertionClosure.validate(ResponseSpecificationImpl.groovy:483) at io.restassured.internal.ResponseSpecificationImpl$HamcrestAssertionClosure$validate$1.call(Unknown Source) at io.restassured.internal.ResponseSpecificationImpl.validateResponseIfRequired(ResponseSpecificationImpl.groovy:655) at org.codehaus.groovy.runtime.callsite.PogoMetaMethodSite$PogoCachedMethodSiteNoUnwrapNoCoerce.invoke(PogoMetaMethodSite.java:210) at org.codehaus.groovy.runtime.callsite.PogoMetaMethodSite.callCurrent(PogoMetaMethodSite.java:59) at org.codehaus.groovy.runtime.callsite.AbstractCallSite.callCurrent(AbstractCallSite.java:166) at io.restassured.internal.ResponseSpecificationImpl.statusCode(ResponseSpecificationImpl.groovy:123) at io.restassured.internal.ValidatableResponseOptionsImpl.statusCode(ValidatableResponseOptionsImpl.java:114) at org.fcrepo.spec.testsuite.AbstractTest.doPatch(AbstractTest.java:450) at org.fcrepo.spec.testsuite.authz.WebACModes.controlAllowedPATCH(WebACModes.java:365) at org.fcrepo.spec.testsuite.App.main(App.java:309) ... Removed 31 stack frames
controlAllowedPUT
java.lang.AssertionError: 1 expectation failed. Expected status code (a value equal to or greater than <200> and a value less than <300>) but a value less than <300> <403> was greater than <300>. at org.codehaus.groovy.runtime.callsite.ConstructorSite$ConstructorSiteNoUnwrap.callConstructor(ConstructorSite.java:84) at org.codehaus.groovy.runtime.callsite.AbstractCallSite.callConstructor(AbstractCallSite.java:247) at io.restassured.internal.ResponseSpecificationImpl$HamcrestAssertionClosure.validate(ResponseSpecificationImpl.groovy:483) at io.restassured.internal.ResponseSpecificationImpl$HamcrestAssertionClosure$validate$1.call(Unknown Source) at io.restassured.internal.ResponseSpecificationImpl.validateResponseIfRequired(ResponseSpecificationImpl.groovy:655) at org.codehaus.groovy.runtime.callsite.PogoMetaMethodSite$PogoCachedMethodSiteNoUnwrapNoCoerce.invoke(PogoMetaMethodSite.java:210) at org.codehaus.groovy.runtime.callsite.PogoMetaMethodSite.callCurrent(PogoMetaMethodSite.java:59) at org.codehaus.groovy.runtime.callsite.AbstractCallSite.callCurrent(AbstractCallSite.java:166) at io.restassured.internal.ResponseSpecificationImpl.statusCode(ResponseSpecificationImpl.groovy:123) at io.restassured.internal.ValidatableResponseOptionsImpl.statusCode(ValidatableResponseOptionsImpl.java:114) at org.fcrepo.spec.testsuite.AbstractTest.doPatch(AbstractTest.java:450) at org.fcrepo.spec.testsuite.authz.WebACModes.controlAllowedPUT(WebACModes.java:398) at org.fcrepo.spec.testsuite.App.main(App.java:309) ... Removed 31 stack frames
controlDisallowedPUT
java.lang.AssertionError: 1 expectation failed. Expected status code <201> but was <403>. at org.codehaus.groovy.runtime.callsite.ConstructorSite$ConstructorSiteNoUnwrap.callConstructor(ConstructorSite.java:84) at org.codehaus.groovy.runtime.callsite.AbstractCallSite.callConstructor(AbstractCallSite.java:247) at io.restassured.internal.ResponseSpecificationImpl$HamcrestAssertionClosure.validate(ResponseSpecificationImpl.groovy:483) at io.restassured.internal.ResponseSpecificationImpl$HamcrestAssertionClosure$validate$1.call(Unknown Source) at io.restassured.internal.ResponseSpecificationImpl.validateResponseIfRequired(ResponseSpecificationImpl.groovy:655) at org.codehaus.groovy.runtime.callsite.PogoMetaMethodSite$PogoCachedMethodSiteNoUnwrapNoCoerce.invoke(PogoMetaMethodSite.java:210) at org.codehaus.groovy.runtime.callsite.PogoMetaMethodSite.callCurrent(PogoMetaMethodSite.java:59) at org.codehaus.groovy.runtime.callsite.AbstractCallSite.callCurrent(AbstractCallSite.java:166) at io.restassured.internal.ResponseSpecificationImpl.statusCode(ResponseSpecificationImpl.groovy:123) at io.restassured.specification.ResponseSpecification$statusCode$0.callCurrent(Unknown Source) at io.restassured.internal.ResponseSpecificationImpl.statusCode(ResponseSpecificationImpl.groovy:131) at io.restassured.internal.ValidatableResponseOptionsImpl.statusCode(ValidatableResponseOptionsImpl.java:119) at org.fcrepo.spec.testsuite.authz.WebACModes.controlDisallowedPUT(WebACModes.java:466) at org.fcrepo.spec.testsuite.App.main(App.java:309) ... Removed 31 stack frames
readAllowedGET
java.lang.AssertionError: 1 expectation failed. Expected status code <200> but was <403>. at org.codehaus.groovy.runtime.callsite.ConstructorSite$ConstructorSiteNoUnwrap.callConstructor(ConstructorSite.java:84) at org.codehaus.groovy.runtime.callsite.AbstractCallSite.callConstructor(AbstractCallSite.java:247) at io.restassured.internal.ResponseSpecificationImpl$HamcrestAssertionClosure.validate(ResponseSpecificationImpl.groovy:483) at io.restassured.internal.ResponseSpecificationImpl$HamcrestAssertionClosure$validate$1.call(Unknown Source) at io.restassured.internal.ResponseSpecificationImpl.validateResponseIfRequired(ResponseSpecificationImpl.groovy:655) at org.codehaus.groovy.runtime.callsite.PogoMetaMethodSite$PogoCachedMethodSiteNoUnwrapNoCoerce.invoke(PogoMetaMethodSite.java:210) at org.codehaus.groovy.runtime.callsite.PogoMetaMethodSite.callCurrent(PogoMetaMethodSite.java:59) at org.codehaus.groovy.runtime.callsite.AbstractCallSite.callCurrent(AbstractCallSite.java:166) at io.restassured.internal.ResponseSpecificationImpl.statusCode(ResponseSpecificationImpl.groovy:123) at io.restassured.specification.ResponseSpecification$statusCode$0.callCurrent(Unknown Source) at io.restassured.internal.ResponseSpecificationImpl.statusCode(ResponseSpecificationImpl.groovy:131) at io.restassured.internal.ValidatableResponseOptionsImpl.statusCode(ValidatableResponseOptionsImpl.java:119) at org.fcrepo.spec.testsuite.AbstractTest.doGet(AbstractTest.java:390) at org.fcrepo.spec.testsuite.authz.WebACModes.readAllowedGET(WebACModes.java:70) at org.fcrepo.spec.testsuite.App.main(App.java:309) ... Removed 31 stack frames
readAllowedHEAD
java.lang.AssertionError: 1 expectation failed. Expected status code <200> but was <403>. at org.codehaus.groovy.runtime.callsite.ConstructorSite$ConstructorSiteNoUnwrap.callConstructor(ConstructorSite.java:84) at org.codehaus.groovy.runtime.callsite.AbstractCallSite.callConstructor(AbstractCallSite.java:247) at io.restassured.internal.ResponseSpecificationImpl$HamcrestAssertionClosure.validate(ResponseSpecificationImpl.groovy:483) at io.restassured.internal.ResponseSpecificationImpl$HamcrestAssertionClosure$validate$1.call(Unknown Source) at io.restassured.internal.ResponseSpecificationImpl.validateResponseIfRequired(ResponseSpecificationImpl.groovy:655) at org.codehaus.groovy.runtime.callsite.PogoMetaMethodSite$PogoCachedMethodSiteNoUnwrapNoCoerce.invoke(PogoMetaMethodSite.java:210) at org.codehaus.groovy.runtime.callsite.PogoMetaMethodSite.callCurrent(PogoMetaMethodSite.java:59) at org.codehaus.groovy.runtime.callsite.AbstractCallSite.callCurrent(AbstractCallSite.java:166) at io.restassured.internal.ResponseSpecificationImpl.statusCode(ResponseSpecificationImpl.groovy:123) at io.restassured.specification.ResponseSpecification$statusCode$0.callCurrent(Unknown Source) at io.restassured.internal.ResponseSpecificationImpl.statusCode(ResponseSpecificationImpl.groovy:131) at io.restassured.internal.ValidatableResponseOptionsImpl.statusCode(ValidatableResponseOptionsImpl.java:119) at org.fcrepo.spec.testsuite.AbstractTest.doHead(AbstractTest.java:434) at org.fcrepo.spec.testsuite.authz.WebACModes.readAllowedHEAD(WebACModes.java:53) at org.fcrepo.spec.testsuite.App.main(App.java:309) ... Removed 30 stack frames
writeAllowedDELETE
java.lang.AssertionError: 1 expectation failed. Expected status code <204> but was <403>. at org.codehaus.groovy.runtime.callsite.ConstructorSite$ConstructorSiteNoUnwrap.callConstructor(ConstructorSite.java:84) at org.codehaus.groovy.runtime.callsite.AbstractCallSite.callConstructor(AbstractCallSite.java:247) at io.restassured.internal.ResponseSpecificationImpl$HamcrestAssertionClosure.validate(ResponseSpecificationImpl.groovy:483) at io.restassured.internal.ResponseSpecificationImpl$HamcrestAssertionClosure$validate$1.call(Unknown Source) at io.restassured.internal.ResponseSpecificationImpl.validateResponseIfRequired(ResponseSpecificationImpl.groovy:655) at org.codehaus.groovy.runtime.callsite.PogoMetaMethodSite$PogoCachedMethodSiteNoUnwrapNoCoerce.invoke(PogoMetaMethodSite.java:210) at org.codehaus.groovy.runtime.callsite.PogoMetaMethodSite.callCurrent(PogoMetaMethodSite.java:59) at org.codehaus.groovy.runtime.callsite.AbstractCallSite.callCurrent(AbstractCallSite.java:166) at io.restassured.internal.ResponseSpecificationImpl.statusCode(ResponseSpecificationImpl.groovy:123) at io.restassured.specification.ResponseSpecification$statusCode$0.callCurrent(Unknown Source) at io.restassured.internal.ResponseSpecificationImpl.statusCode(ResponseSpecificationImpl.groovy:131) at io.restassured.internal.ValidatableResponseOptionsImpl.statusCode(ValidatableResponseOptionsImpl.java:119) at org.fcrepo.spec.testsuite.AbstractTest.doDelete(AbstractTest.java:422) at org.fcrepo.spec.testsuite.authz.WebACModes.writeAllowedDELETE(WebACModes.java:150) at org.fcrepo.spec.testsuite.App.main(App.java:309) ... Removed 30 stack frames
writeAllowedPATCH
java.lang.AssertionError: 1 expectation failed. Expected status code (a value equal to or greater than <200> and a value less than <300>) but a value less than <300> <403> was greater than <300>. at org.codehaus.groovy.runtime.callsite.ConstructorSite$ConstructorSiteNoUnwrap.callConstructor(ConstructorSite.java:84) at org.codehaus.groovy.runtime.callsite.AbstractCallSite.callConstructor(AbstractCallSite.java:247) at io.restassured.internal.ResponseSpecificationImpl$HamcrestAssertionClosure.validate(ResponseSpecificationImpl.groovy:483) at io.restassured.internal.ResponseSpecificationImpl$HamcrestAssertionClosure$validate$1.call(Unknown Source) at io.restassured.internal.ResponseSpecificationImpl.validateResponseIfRequired(ResponseSpecificationImpl.groovy:655) at org.codehaus.groovy.runtime.callsite.PogoMetaMethodSite$PogoCachedMethodSiteNoUnwrapNoCoerce.invoke(PogoMetaMethodSite.java:210) at org.codehaus.groovy.runtime.callsite.PogoMetaMethodSite.callCurrent(PogoMetaMethodSite.java:59) at org.codehaus.groovy.runtime.callsite.AbstractCallSite.callCurrent(AbstractCallSite.java:166) at io.restassured.internal.ResponseSpecificationImpl.statusCode(ResponseSpecificationImpl.groovy:123) at io.restassured.internal.ValidatableResponseOptionsImpl.statusCode(ValidatableResponseOptionsImpl.java:114) at org.fcrepo.spec.testsuite.AbstractTest.doPatch(AbstractTest.java:450) at org.fcrepo.spec.testsuite.authz.WebACModes.writeAllowedPATCH(WebACModes.java:173) at org.fcrepo.spec.testsuite.App.main(App.java:309) ... Removed 30 stack frames
writeAllowedPOST
java.lang.AssertionError: 1 expectation failed. Expected status code <201> but was <403>. at org.codehaus.groovy.runtime.callsite.ConstructorSite$ConstructorSiteNoUnwrap.callConstructor(ConstructorSite.java:84) at org.codehaus.groovy.runtime.callsite.AbstractCallSite.callConstructor(AbstractCallSite.java:247) at io.restassured.internal.ResponseSpecificationImpl$HamcrestAssertionClosure.validate(ResponseSpecificationImpl.groovy:483) at io.restassured.internal.ResponseSpecificationImpl$HamcrestAssertionClosure$validate$1.call(Unknown Source) at io.restassured.internal.ResponseSpecificationImpl.validateResponseIfRequired(ResponseSpecificationImpl.groovy:655) at org.codehaus.groovy.runtime.callsite.PogoMetaMethodSite$PogoCachedMethodSiteNoUnwrapNoCoerce.invoke(PogoMetaMethodSite.java:210) at org.codehaus.groovy.runtime.callsite.PogoMetaMethodSite.callCurrent(PogoMetaMethodSite.java:59) at org.codehaus.groovy.runtime.callsite.AbstractCallSite.callCurrent(AbstractCallSite.java:166) at io.restassured.internal.ResponseSpecificationImpl.statusCode(ResponseSpecificationImpl.groovy:123) at io.restassured.specification.ResponseSpecification$statusCode$0.callCurrent(Unknown Source) at io.restassured.internal.ResponseSpecificationImpl.statusCode(ResponseSpecificationImpl.groovy:131) at io.restassured.internal.ValidatableResponseOptionsImpl.statusCode(ValidatableResponseOptionsImpl.java:119) at org.fcrepo.spec.testsuite.AbstractTest.doPost(AbstractTest.java:272) at org.fcrepo.spec.testsuite.authz.WebACModes.writeAllowedPOST(WebACModes.java:132) at org.fcrepo.spec.testsuite.App.main(App.java:309) ... Removed 30 stack frames
writeAllowedPUT
java.lang.AssertionError: 1 expectation failed. Expected status code <201> but was <403>. at org.codehaus.groovy.runtime.callsite.ConstructorSite$ConstructorSiteNoUnwrap.callConstructor(ConstructorSite.java:84) at org.codehaus.groovy.runtime.callsite.AbstractCallSite.callConstructor(AbstractCallSite.java:247) at io.restassured.internal.ResponseSpecificationImpl$HamcrestAssertionClosure.validate(ResponseSpecificationImpl.groovy:483) at io.restassured.internal.ResponseSpecificationImpl$HamcrestAssertionClosure$validate$1.call(Unknown Source) at io.restassured.internal.ResponseSpecificationImpl.validateResponseIfRequired(ResponseSpecificationImpl.groovy:655) at org.codehaus.groovy.runtime.callsite.PogoMetaMethodSite$PogoCachedMethodSiteNoUnwrapNoCoerce.invoke(PogoMetaMethodSite.java:210) at org.codehaus.groovy.runtime.callsite.PogoMetaMethodSite.callCurrent(PogoMetaMethodSite.java:59) at org.codehaus.groovy.runtime.callsite.AbstractCallSite.callCurrent(AbstractCallSite.java:166) at io.restassured.internal.ResponseSpecificationImpl.statusCode(ResponseSpecificationImpl.groovy:123) at io.restassured.specification.ResponseSpecification$statusCode$0.callCurrent(Unknown Source) at io.restassured.internal.ResponseSpecificationImpl.statusCode(ResponseSpecificationImpl.groovy:131) at io.restassured.internal.ValidatableResponseOptionsImpl.statusCode(ValidatableResponseOptionsImpl.java:119) at org.fcrepo.spec.testsuite.authz.WebACModes.writeAllowedPUT(WebACModes.java:113) at org.fcrepo.spec.testsuite.App.main(App.java:309) ... Removed 30 stack frames
org.fcrepo.spec.testsuite.crud.Container
ldpDirectContainerSupportOrConstraintsDocument
java.lang.AssertionError: Unexpected response code: 400 at org.fcrepo.spec.testsuite.crud.Container.ldpDirectContainerSupportOrConstraintsDocument(Container.java:1399) at org.fcrepo.spec.testsuite.App.main(App.java:309) ... Removed 23 stack frames
ldpIndirectContainerSupportOrConstraintsDocument
java.lang.AssertionError: Unexpected response code: 400 at org.fcrepo.spec.testsuite.crud.Container.ldpIndirectContainerSupportOrConstraintsDocument(Container.java:1424) at org.fcrepo.spec.testsuite.App.main(App.java:309) ... Removed 23 stack frames
org.fcrepo.spec.testsuite.crud.HttpPut
httpPutUpdateDisallowedTriples
java.lang.AssertionError: 1 expectation failed. Expected status code (a value equal to or greater than <400> and a value less than <500>) but a value equal to or greater than <400> <204> was less than <400>. at org.codehaus.groovy.runtime.callsite.ConstructorSite$ConstructorSiteNoUnwrap.callConstructor(ConstructorSite.java:84) at org.codehaus.groovy.runtime.callsite.AbstractCallSite.callConstructor(AbstractCallSite.java:247) at io.restassured.internal.ResponseSpecificationImpl$HamcrestAssertionClosure.validate(ResponseSpecificationImpl.groovy:483) at io.restassured.internal.ResponseSpecificationImpl$HamcrestAssertionClosure$validate$1.call(Unknown Source) at io.restassured.internal.ResponseSpecificationImpl.validateResponseIfRequired(ResponseSpecificationImpl.groovy:655) at org.codehaus.groovy.runtime.callsite.PogoMetaMethodSite$PogoCachedMethodSiteNoUnwrapNoCoerce.invoke(PogoMetaMethodSite.java:210) at org.codehaus.groovy.runtime.callsite.PogoMetaMethodSite.callCurrent(PogoMetaMethodSite.java:59) at org.codehaus.groovy.runtime.callsite.AbstractCallSite.callCurrent(AbstractCallSite.java:166) at io.restassured.internal.ResponseSpecificationImpl.statusCode(ResponseSpecificationImpl.groovy:123) at io.restassured.internal.ValidatableResponseOptionsImpl.statusCode(ValidatableResponseOptionsImpl.java:114) at org.fcrepo.spec.testsuite.crud.HttpPut.httpPutUpdateDisallowedTriples(HttpPut.java:188) at org.fcrepo.spec.testsuite.App.main(App.java:309) ... Removed 30 stack frames
httpPutUpdateDisallowedTriplesConstrainedByHeader
java.lang.AssertionError: 1 expectation failed. Expected status code <409> but was <204>. at org.codehaus.groovy.runtime.callsite.ConstructorSite$ConstructorSiteNoUnwrap.callConstructor(ConstructorSite.java:84) at org.codehaus.groovy.runtime.callsite.AbstractCallSite.callConstructor(AbstractCallSite.java:247) at io.restassured.internal.ResponseSpecificationImpl$HamcrestAssertionClosure.validate(ResponseSpecificationImpl.groovy:483) at io.restassured.internal.ResponseSpecificationImpl$HamcrestAssertionClosure$validate$1.call(Unknown Source) at io.restassured.internal.ResponseSpecificationImpl.validateResponseIfRequired(ResponseSpecificationImpl.groovy:655) at org.codehaus.groovy.runtime.callsite.PogoMetaMethodSite$PogoCachedMethodSiteNoUnwrapNoCoerce.invoke(PogoMetaMethodSite.java:210) at org.codehaus.groovy.runtime.callsite.PogoMetaMethodSite.callCurrent(PogoMetaMethodSite.java:59) at org.codehaus.groovy.runtime.callsite.AbstractCallSite.callCurrent(AbstractCallSite.java:166) at io.restassured.internal.ResponseSpecificationImpl.statusCode(ResponseSpecificationImpl.groovy:123) at io.restassured.specification.ResponseSpecification$statusCode$0.callCurrent(Unknown Source) at io.restassured.internal.ResponseSpecificationImpl.statusCode(ResponseSpecificationImpl.groovy:131) at io.restassured.internal.ValidatableResponseOptionsImpl.statusCode(ValidatableResponseOptionsImpl.java:119) at org.fcrepo.spec.testsuite.crud.HttpPut.httpPutUpdateDisallowedTriplesConstrainedByHeader(HttpPut.java:274) at org.fcrepo.spec.testsuite.App.main(App.java:309) ... Removed 30 stack frames
httpPutUpdateDisallowedTriplesResponse
java.lang.AssertionError: 1 expectation failed. Expected status code <409> but was <204>. at org.codehaus.groovy.runtime.callsite.ConstructorSite$ConstructorSiteNoUnwrap.callConstructor(ConstructorSite.java:84) at org.codehaus.groovy.runtime.callsite.AbstractCallSite.callConstructor(AbstractCallSite.java:247) at io.restassured.internal.ResponseSpecificationImpl$HamcrestAssertionClosure.validate(ResponseSpecificationImpl.groovy:483) at io.restassured.internal.ResponseSpecificationImpl$HamcrestAssertionClosure$validate$1.call(Unknown Source) at io.restassured.internal.ResponseSpecificationImpl.validateResponseIfRequired(ResponseSpecificationImpl.groovy:655) at org.codehaus.groovy.runtime.callsite.PogoMetaMethodSite$PogoCachedMethodSiteNoUnwrapNoCoerce.invoke(PogoMetaMethodSite.java:210) at org.codehaus.groovy.runtime.callsite.PogoMetaMethodSite.callCurrent(PogoMetaMethodSite.java:59) at org.codehaus.groovy.runtime.callsite.AbstractCallSite.callCurrent(AbstractCallSite.java:166) at io.restassured.internal.ResponseSpecificationImpl.statusCode(ResponseSpecificationImpl.groovy:123) at io.restassured.specification.ResponseSpecification$statusCode$0.callCurrent(Unknown Source) at io.restassured.internal.ResponseSpecificationImpl.statusCode(ResponseSpecificationImpl.groovy:131) at io.restassured.internal.ValidatableResponseOptionsImpl.statusCode(ValidatableResponseOptionsImpl.java:119) at org.fcrepo.spec.testsuite.crud.HttpPut.httpPutUpdateDisallowedTriplesResponse(HttpPut.java:229) at org.fcrepo.spec.testsuite.App.main(App.java:309) ... Removed 30 stack frames
nonRDFSourcePutDigestResponseHeaderAuthentication
java.lang.AssertionError: 1 expectation failed. Expected status code <409> but was <204>. at org.codehaus.groovy.runtime.callsite.ConstructorSite$ConstructorSiteNoUnwrap.callConstructor(ConstructorSite.java:84) at org.codehaus.groovy.runtime.callsite.AbstractCallSite.callConstructor(AbstractCallSite.java:247) at io.restassured.internal.ResponseSpecificationImpl$HamcrestAssertionClosure.validate(ResponseSpecificationImpl.groovy:483) at io.restassured.internal.ResponseSpecificationImpl$HamcrestAssertionClosure$validate$1.call(Unknown Source) at io.restassured.internal.ResponseSpecificationImpl.validateResponseIfRequired(ResponseSpecificationImpl.groovy:655) at org.codehaus.groovy.runtime.callsite.PogoMetaMethodSite$PogoCachedMethodSiteNoUnwrapNoCoerce.invoke(PogoMetaMethodSite.java:210) at org.codehaus.groovy.runtime.callsite.PogoMetaMethodSite.callCurrent(PogoMetaMethodSite.java:59) at org.codehaus.groovy.runtime.callsite.AbstractCallSite.callCurrent(AbstractCallSite.java:166) at io.restassured.internal.ResponseSpecificationImpl.statusCode(ResponseSpecificationImpl.groovy:123) at io.restassured.specification.ResponseSpecification$statusCode$0.callCurrent(Unknown Source) at io.restassured.internal.ResponseSpecificationImpl.statusCode(ResponseSpecificationImpl.groovy:131) at io.restassured.internal.ValidatableResponseOptionsImpl.statusCode(ValidatableResponseOptionsImpl.java:119) at org.fcrepo.spec.testsuite.crud.HttpPut.nonRDFSourcePutDigestResponseHeaderAuthentication(HttpPut.java:337) at org.fcrepo.spec.testsuite.App.main(App.java:309) ... Removed 30 stack frames
org.fcrepo.spec.testsuite.crud.HttpPatch
disallowChangeResourceType
java.lang.AssertionError: 1 expectation failed. Expected status code <409> but was <204>. at org.codehaus.groovy.runtime.callsite.ConstructorSite$ConstructorSiteNoUnwrap.callConstructor(ConstructorSite.java:84) at org.codehaus.groovy.runtime.callsite.AbstractCallSite.callConstructor(AbstractCallSite.java:247) at io.restassured.internal.ResponseSpecificationImpl$HamcrestAssertionClosure.validate(ResponseSpecificationImpl.groovy:483) at io.restassured.internal.ResponseSpecificationImpl$HamcrestAssertionClosure$validate$1.call(Unknown Source) at io.restassured.internal.ResponseSpecificationImpl.validateResponseIfRequired(ResponseSpecificationImpl.groovy:655) at org.codehaus.groovy.runtime.callsite.PogoMetaMethodSite$PogoCachedMethodSiteNoUnwrapNoCoerce.invoke(PogoMetaMethodSite.java:210) at org.codehaus.groovy.runtime.callsite.PogoMetaMethodSite.callCurrent(PogoMetaMethodSite.java:59) at org.codehaus.groovy.runtime.callsite.AbstractCallSite.callCurrent(AbstractCallSite.java:166) at io.restassured.internal.ResponseSpecificationImpl.statusCode(ResponseSpecificationImpl.groovy:123) at io.restassured.specification.ResponseSpecification$statusCode$0.callCurrent(Unknown Source) at io.restassured.internal.ResponseSpecificationImpl.statusCode(ResponseSpecificationImpl.groovy:131) at io.restassured.internal.ValidatableResponseOptionsImpl.statusCode(ValidatableResponseOptionsImpl.java:119) at org.fcrepo.spec.testsuite.crud.HttpPatch.disallowChangeResourceType(HttpPatch.java:246) at org.fcrepo.spec.testsuite.App.main(App.java:309) ... Removed 30 stack frames
statementNotPersistedConstrainedBy
java.lang.AssertionError: 1 expectation failed. Expected status code <200> but was <301>. at org.codehaus.groovy.runtime.callsite.ConstructorSite$ConstructorSiteNoUnwrap.callConstructor(ConstructorSite.java:84) at org.codehaus.groovy.runtime.callsite.AbstractCallSite.callConstructor(AbstractCallSite.java:247) at io.restassured.internal.ResponseSpecificationImpl$HamcrestAssertionClosure.validate(ResponseSpecificationImpl.groovy:483) at io.restassured.internal.ResponseSpecificationImpl$HamcrestAssertionClosure$validate$1.call(Unknown Source) at io.restassured.internal.ResponseSpecificationImpl.validateResponseIfRequired(ResponseSpecificationImpl.groovy:655) at org.codehaus.groovy.runtime.callsite.PogoMetaMethodSite$PogoCachedMethodSiteNoUnwrapNoCoerce.invoke(PogoMetaMethodSite.java:210) at org.codehaus.groovy.runtime.callsite.PogoMetaMethodSite.callCurrent(PogoMetaMethodSite.java:59) at org.codehaus.groovy.runtime.callsite.AbstractCallSite.callCurrent(AbstractCallSite.java:166) at io.restassured.internal.ResponseSpecificationImpl.statusCode(ResponseSpecificationImpl.groovy:123) at io.restassured.specification.ResponseSpecification$statusCode$0.callCurrent(Unknown Source) at io.restassured.internal.ResponseSpecificationImpl.statusCode(ResponseSpecificationImpl.groovy:131) at io.restassured.internal.ValidatableResponseOptionsImpl.statusCode(ValidatableResponseOptionsImpl.java:119) at org.fcrepo.spec.testsuite.AbstractTest.doGet(AbstractTest.java:390) at org.fcrepo.spec.testsuite.AbstractTest.doGet(AbstractTest.java:396) at org.fcrepo.spec.testsuite.AbstractTest.confirmPresenceOfConstrainedByLink(AbstractTest.java:594) at org.fcrepo.spec.testsuite.crud.HttpPatch.statementNotPersistedConstrainedBy(HttpPatch.java:171) at org.fcrepo.spec.testsuite.App.main(App.java:309) ... Removed 30 stack frames
org.fcrepo.spec.testsuite.authz.WebACAccessToClass
accessToClassMustGiveAccessToBinary
java.lang.AssertionError: 1 expectation failed. Expected status code <200> but was <403>. at org.codehaus.groovy.runtime.callsite.ConstructorSite$ConstructorSiteNoUnwrap.callConstructor(ConstructorSite.java:84) at org.codehaus.groovy.runtime.callsite.AbstractCallSite.callConstructor(AbstractCallSite.java:247) at io.restassured.internal.ResponseSpecificationImpl$HamcrestAssertionClosure.validate(ResponseSpecificationImpl.groovy:483) at io.restassured.internal.ResponseSpecificationImpl$HamcrestAssertionClosure$validate$1.call(Unknown Source) at io.restassured.internal.ResponseSpecificationImpl.validateResponseIfRequired(ResponseSpecificationImpl.groovy:655) at org.codehaus.groovy.runtime.callsite.PogoMetaMethodSite$PogoCachedMethodSiteNoUnwrapNoCoerce.invoke(PogoMetaMethodSite.java:210) at org.codehaus.groovy.runtime.callsite.PogoMetaMethodSite.callCurrent(PogoMetaMethodSite.java:59) at org.codehaus.groovy.runtime.callsite.AbstractCallSite.callCurrent(AbstractCallSite.java:166) at io.restassured.internal.ResponseSpecificationImpl.statusCode(ResponseSpecificationImpl.groovy:123) at io.restassured.specification.ResponseSpecification$statusCode$0.callCurrent(Unknown Source) at io.restassured.internal.ResponseSpecificationImpl.statusCode(ResponseSpecificationImpl.groovy:131) at io.restassured.internal.ValidatableResponseOptionsImpl.statusCode(ValidatableResponseOptionsImpl.java:119) at org.fcrepo.spec.testsuite.AbstractTest.doGet(AbstractTest.java:390) at org.fcrepo.spec.testsuite.authz.WebACAccessToClass.accessToClassMustGiveAccessToBinary(WebACAccessToClass.java:92) at org.fcrepo.spec.testsuite.App.main(App.java:309) ... Removed 30 stack frames
accessToClassMustGiveAccessToContainer
java.lang.AssertionError: 1 expectation failed. Expected status code <200> but was <403>. at org.codehaus.groovy.runtime.callsite.ConstructorSite$ConstructorSiteNoUnwrap.callConstructor(ConstructorSite.java:84) at org.codehaus.groovy.runtime.callsite.AbstractCallSite.callConstructor(AbstractCallSite.java:247) at io.restassured.internal.ResponseSpecificationImpl$HamcrestAssertionClosure.validate(ResponseSpecificationImpl.groovy:483) at io.restassured.internal.ResponseSpecificationImpl$HamcrestAssertionClosure$validate$1.call(Unknown Source) at io.restassured.internal.ResponseSpecificationImpl.validateResponseIfRequired(ResponseSpecificationImpl.groovy:655) at org.codehaus.groovy.runtime.callsite.PogoMetaMethodSite$PogoCachedMethodSiteNoUnwrapNoCoerce.invoke(PogoMetaMethodSite.java:210) at org.codehaus.groovy.runtime.callsite.PogoMetaMethodSite.callCurrent(PogoMetaMethodSite.java:59) at org.codehaus.groovy.runtime.callsite.AbstractCallSite.callCurrent(AbstractCallSite.java:166) at io.restassured.internal.ResponseSpecificationImpl.statusCode(ResponseSpecificationImpl.groovy:123) at io.restassured.specification.ResponseSpecification$statusCode$0.callCurrent(Unknown Source) at io.restassured.internal.ResponseSpecificationImpl.statusCode(ResponseSpecificationImpl.groovy:131) at io.restassured.internal.ValidatableResponseOptionsImpl.statusCode(ValidatableResponseOptionsImpl.java:119) at org.fcrepo.spec.testsuite.AbstractTest.doGet(AbstractTest.java:390) at org.fcrepo.spec.testsuite.authz.WebACAccessToClass.accessToClassMustGiveAccessToContainer(WebACAccessToClass.java:60) at org.fcrepo.spec.testsuite.App.main(App.java:309) ... Removed 30 stack frames
org.fcrepo.spec.testsuite.authz.WebACLinking
conflictIfNotSupportingAclLink
java.lang.AssertionError: Response does not contain a link of rel type = http://www.w3.org/ns/ldp#constrainedBy at org.fcrepo.spec.testsuite.AbstractTest.confirmPresenceOfConstrainedByLink(AbstractTest.java:591) at org.fcrepo.spec.testsuite.authz.WebACLinking.conflictIfNotSupportingAclLink(WebACLinking.java:92) at org.fcrepo.spec.testsuite.App.main(App.java:309) ... Removed 23 stack frames
org.fcrepo.spec.testsuite.versioning.LdpcvHttpPost
ldpcvDoesNotSupportPost
java.lang.AssertionError: Response does not contain a link of rel type = http://www.w3.org/ns/ldp#constrainedBy at org.fcrepo.spec.testsuite.AbstractTest.confirmPresenceOfConstrainedByLink(AbstractTest.java:591) at org.fcrepo.spec.testsuite.versioning.LdpcvHttpPost.ldpcvDoesNotSupportPost(LdpcvHttpPost.java:298) at org.fcrepo.spec.testsuite.App.main(App.java:309) ... Removed 23 stack frames
postToldpcvOfLdpnrWithoutMementoDatetimeMustIgnoreBody
java.lang.AssertionError: 1 expectation failed. Expected status code <201> but was <405>. at org.codehaus.groovy.runtime.callsite.ConstructorSite$ConstructorSiteNoUnwrap.callConstructor(ConstructorSite.java:84) at org.codehaus.groovy.runtime.callsite.AbstractCallSite.callConstructor(AbstractCallSite.java:247) at io.restassured.internal.ResponseSpecificationImpl$HamcrestAssertionClosure.validate(ResponseSpecificationImpl.groovy:483) at io.restassured.internal.ResponseSpecificationImpl$HamcrestAssertionClosure$validate$1.call(Unknown Source) at io.restassured.internal.ResponseSpecificationImpl.validateResponseIfRequired(ResponseSpecificationImpl.groovy:655) at org.codehaus.groovy.runtime.callsite.PogoMetaMethodSite$PogoCachedMethodSiteNoUnwrapNoCoerce.invoke(PogoMetaMethodSite.java:210) at org.codehaus.groovy.runtime.callsite.PogoMetaMethodSite.callCurrent(PogoMetaMethodSite.java:59) at org.codehaus.groovy.runtime.callsite.AbstractCallSite.callCurrent(AbstractCallSite.java:166) at io.restassured.internal.ResponseSpecificationImpl.statusCode(ResponseSpecificationImpl.groovy:123) at io.restassured.specification.ResponseSpecification$statusCode$0.callCurrent(Unknown Source) at io.restassured.internal.ResponseSpecificationImpl.statusCode(ResponseSpecificationImpl.groovy:131) at io.restassured.internal.ValidatableResponseOptionsImpl.statusCode(ValidatableResponseOptionsImpl.java:119) at org.fcrepo.spec.testsuite.AbstractTest.doPost(AbstractTest.java:272) at org.fcrepo.spec.testsuite.AbstractTest.doPost(AbstractTest.java:285) at org.fcrepo.spec.testsuite.versioning.LdpcvHttpPost.postToldpcvOfLdpnrWithoutMementoDatetimeMustIgnoreBody(LdpcvHttpPost.java:198) at org.fcrepo.spec.testsuite.App.main(App.java:309) ... Removed 30 stack frames
postToldpcvOfLdprsWithoutMementoDatetimeMustIgnoreBody
java.lang.AssertionError: 1 expectation failed. Expected status code <201> but was <405>. at org.codehaus.groovy.runtime.callsite.ConstructorSite$ConstructorSiteNoUnwrap.callConstructor(ConstructorSite.java:84) at org.codehaus.groovy.runtime.callsite.AbstractCallSite.callConstructor(AbstractCallSite.java:247) at io.restassured.internal.ResponseSpecificationImpl$HamcrestAssertionClosure.validate(ResponseSpecificationImpl.groovy:483) at io.restassured.internal.ResponseSpecificationImpl$HamcrestAssertionClosure$validate$1.call(Unknown Source) at io.restassured.internal.ResponseSpecificationImpl.validateResponseIfRequired(ResponseSpecificationImpl.groovy:655) at org.codehaus.groovy.runtime.callsite.PogoMetaMethodSite$PogoCachedMethodSiteNoUnwrapNoCoerce.invoke(PogoMetaMethodSite.java:210) at org.codehaus.groovy.runtime.callsite.PogoMetaMethodSite.callCurrent(PogoMetaMethodSite.java:59) at org.codehaus.groovy.runtime.callsite.AbstractCallSite.callCurrent(AbstractCallSite.java:166) at io.restassured.internal.ResponseSpecificationImpl.statusCode(ResponseSpecificationImpl.groovy:123) at io.restassured.specification.ResponseSpecification$statusCode$0.callCurrent(Unknown Source) at io.restassured.internal.ResponseSpecificationImpl.statusCode(ResponseSpecificationImpl.groovy:131) at io.restassured.internal.ValidatableResponseOptionsImpl.statusCode(ValidatableResponseOptionsImpl.java:119) at org.fcrepo.spec.testsuite.AbstractTest.doPost(AbstractTest.java:272) at org.fcrepo.spec.testsuite.AbstractTest.doPost(AbstractTest.java:285) at org.fcrepo.spec.testsuite.versioning.LdpcvHttpPost.postToldpcvOfLdprsWithoutMementoDatetimeMustIgnoreBody(LdpcvHttpPost.java:164) at org.fcrepo.spec.testsuite.App.main(App.java:309) ... Removed 30 stack frames
org.fcrepo.spec.testsuite.authz.WebACGeneral
agentAll
java.lang.AssertionError: 1 expectation failed. Expected status code <200> but was <403>. at org.codehaus.groovy.runtime.callsite.ConstructorSite$ConstructorSiteNoUnwrap.callConstructor(ConstructorSite.java:84) at org.codehaus.groovy.runtime.callsite.AbstractCallSite.callConstructor(AbstractCallSite.java:247) at io.restassured.internal.ResponseSpecificationImpl$HamcrestAssertionClosure.validate(ResponseSpecificationImpl.groovy:483) at io.restassured.internal.ResponseSpecificationImpl$HamcrestAssertionClosure$validate$1.call(Unknown Source) at io.restassured.internal.ResponseSpecificationImpl.validateResponseIfRequired(ResponseSpecificationImpl.groovy:655) at org.codehaus.groovy.runtime.callsite.PogoMetaMethodSite$PogoCachedMethodSiteNoUnwrapNoCoerce.invoke(PogoMetaMethodSite.java:210) at org.codehaus.groovy.runtime.callsite.PogoMetaMethodSite.callCurrent(PogoMetaMethodSite.java:59) at org.codehaus.groovy.runtime.callsite.AbstractCallSite.callCurrent(AbstractCallSite.java:166) at io.restassured.internal.ResponseSpecificationImpl.statusCode(ResponseSpecificationImpl.groovy:123) at io.restassured.specification.ResponseSpecification$statusCode$0.callCurrent(Unknown Source) at io.restassured.internal.ResponseSpecificationImpl.statusCode(ResponseSpecificationImpl.groovy:131) at io.restassured.internal.ValidatableResponseOptionsImpl.statusCode(ValidatableResponseOptionsImpl.java:119) at org.fcrepo.spec.testsuite.AbstractTest.doGet(AbstractTest.java:390) at org.fcrepo.spec.testsuite.authz.WebACGeneral.agentAll(WebACGeneral.java:148) at org.fcrepo.spec.testsuite.App.main(App.java:309) ... Removed 30 stack frames
agentDouble
java.lang.AssertionError: 1 expectation failed. Expected status code <200> but was <403>. at org.codehaus.groovy.runtime.callsite.ConstructorSite$ConstructorSiteNoUnwrap.callConstructor(ConstructorSite.java:84) at org.codehaus.groovy.runtime.callsite.AbstractCallSite.callConstructor(AbstractCallSite.java:247) at io.restassured.internal.ResponseSpecificationImpl$HamcrestAssertionClosure.validate(ResponseSpecificationImpl.groovy:483) at io.restassured.internal.ResponseSpecificationImpl$HamcrestAssertionClosure$validate$1.call(Unknown Source) at io.restassured.internal.ResponseSpecificationImpl.validateResponseIfRequired(ResponseSpecificationImpl.groovy:655) at org.codehaus.groovy.runtime.callsite.PogoMetaMethodSite$PogoCachedMethodSiteNoUnwrapNoCoerce.invoke(PogoMetaMethodSite.java:210) at org.codehaus.groovy.runtime.callsite.PogoMetaMethodSite.callCurrent(PogoMetaMethodSite.java:59) at org.codehaus.groovy.runtime.callsite.AbstractCallSite.callCurrent(AbstractCallSite.java:166) at io.restassured.internal.ResponseSpecificationImpl.statusCode(ResponseSpecificationImpl.groovy:123) at io.restassured.specification.ResponseSpecification$statusCode$0.callCurrent(Unknown Source) at io.restassured.internal.ResponseSpecificationImpl.statusCode(ResponseSpecificationImpl.groovy:131) at io.restassured.internal.ValidatableResponseOptionsImpl.statusCode(ValidatableResponseOptionsImpl.java:119) at org.fcrepo.spec.testsuite.AbstractTest.doGet(AbstractTest.java:390) at org.fcrepo.spec.testsuite.authz.WebACGeneral.agentDouble(WebACGeneral.java:65) at org.fcrepo.spec.testsuite.App.main(App.java:309) ... Removed 30 stack frames
agentGroup
java.lang.AssertionError: 1 expectation failed. Expected status code <200> but was <403>. at org.codehaus.groovy.runtime.callsite.ConstructorSite$ConstructorSiteNoUnwrap.callConstructor(ConstructorSite.java:84) at org.codehaus.groovy.runtime.callsite.AbstractCallSite.callConstructor(AbstractCallSite.java:247) at io.restassured.internal.ResponseSpecificationImpl$HamcrestAssertionClosure.validate(ResponseSpecificationImpl.groovy:483) at io.restassured.internal.ResponseSpecificationImpl$HamcrestAssertionClosure$validate$1.call(Unknown Source) at io.restassured.internal.ResponseSpecificationImpl.validateResponseIfRequired(ResponseSpecificationImpl.groovy:655) at org.codehaus.groovy.runtime.callsite.PogoMetaMethodSite$PogoCachedMethodSiteNoUnwrapNoCoerce.invoke(PogoMetaMethodSite.java:210) at org.codehaus.groovy.runtime.callsite.PogoMetaMethodSite.callCurrent(PogoMetaMethodSite.java:59) at org.codehaus.groovy.runtime.callsite.AbstractCallSite.callCurrent(AbstractCallSite.java:166) at io.restassured.internal.ResponseSpecificationImpl.statusCode(ResponseSpecificationImpl.groovy:123) at io.restassured.specification.ResponseSpecification$statusCode$0.callCurrent(Unknown Source) at io.restassured.internal.ResponseSpecificationImpl.statusCode(ResponseSpecificationImpl.groovy:131) at io.restassured.internal.ValidatableResponseOptionsImpl.statusCode(ValidatableResponseOptionsImpl.java:119) at org.fcrepo.spec.testsuite.AbstractTest.doGet(AbstractTest.java:390) at org.fcrepo.spec.testsuite.authz.WebACGeneral.agentGroup(WebACGeneral.java:98) at org.fcrepo.spec.testsuite.App.main(App.java:309) ... Removed 30 stack frames
agentGroupWithHashUris
java.lang.AssertionError: 1 expectation failed. Expected status code <200> but was <403>. at org.codehaus.groovy.runtime.callsite.ConstructorSite$ConstructorSiteNoUnwrap.callConstructor(ConstructorSite.java:84) at org.codehaus.groovy.runtime.callsite.AbstractCallSite.callConstructor(AbstractCallSite.java:247) at io.restassured.internal.ResponseSpecificationImpl$HamcrestAssertionClosure.validate(ResponseSpecificationImpl.groovy:483) at io.restassured.internal.ResponseSpecificationImpl$HamcrestAssertionClosure$validate$1.call(Unknown Source) at io.restassured.internal.ResponseSpecificationImpl.validateResponseIfRequired(ResponseSpecificationImpl.groovy:655) at org.codehaus.groovy.runtime.callsite.PogoMetaMethodSite$PogoCachedMethodSiteNoUnwrapNoCoerce.invoke(PogoMetaMethodSite.java:210) at org.codehaus.groovy.runtime.callsite.PogoMetaMethodSite.callCurrent(PogoMetaMethodSite.java:59) at org.codehaus.groovy.runtime.callsite.AbstractCallSite.callCurrent(AbstractCallSite.java:166) at io.restassured.internal.ResponseSpecificationImpl.statusCode(ResponseSpecificationImpl.groovy:123) at io.restassured.specification.ResponseSpecification$statusCode$0.callCurrent(Unknown Source) at io.restassured.internal.ResponseSpecificationImpl.statusCode(ResponseSpecificationImpl.groovy:131) at io.restassured.internal.ValidatableResponseOptionsImpl.statusCode(ValidatableResponseOptionsImpl.java:119) at org.fcrepo.spec.testsuite.AbstractTest.doGet(AbstractTest.java:390) at org.fcrepo.spec.testsuite.authz.WebACGeneral.agentGroupWithHashUris(WebACGeneral.java:131) at org.fcrepo.spec.testsuite.App.main(App.java:309) ... Removed 30 stack frames
agentSingle
java.lang.AssertionError: 1 expectation failed. Expected status code <200> but was <403>. at org.codehaus.groovy.runtime.callsite.ConstructorSite$ConstructorSiteNoUnwrap.callConstructor(ConstructorSite.java:84) at org.codehaus.groovy.runtime.callsite.AbstractCallSite.callConstructor(AbstractCallSite.java:247) at io.restassured.internal.ResponseSpecificationImpl$HamcrestAssertionClosure.validate(ResponseSpecificationImpl.groovy:483) at io.restassured.internal.ResponseSpecificationImpl$HamcrestAssertionClosure$validate$1.call(Unknown Source) at io.restassured.internal.ResponseSpecificationImpl.validateResponseIfRequired(ResponseSpecificationImpl.groovy:655) at org.codehaus.groovy.runtime.callsite.PogoMetaMethodSite$PogoCachedMethodSiteNoUnwrapNoCoerce.invoke(PogoMetaMethodSite.java:210) at org.codehaus.groovy.runtime.callsite.PogoMetaMethodSite.callCurrent(PogoMetaMethodSite.java:59) at org.codehaus.groovy.runtime.callsite.AbstractCallSite.callCurrent(AbstractCallSite.java:166) at io.restassured.internal.ResponseSpecificationImpl.statusCode(ResponseSpecificationImpl.groovy:123) at io.restassured.specification.ResponseSpecification$statusCode$0.callCurrent(Unknown Source) at io.restassured.internal.ResponseSpecificationImpl.statusCode(ResponseSpecificationImpl.groovy:131) at io.restassured.internal.ValidatableResponseOptionsImpl.statusCode(ValidatableResponseOptionsImpl.java:119) at org.fcrepo.spec.testsuite.AbstractTest.doGet(AbstractTest.java:390) at org.fcrepo.spec.testsuite.authz.WebACGeneral.agentSingle(WebACGeneral.java:50) at org.fcrepo.spec.testsuite.App.main(App.java:309) ... Removed 30 stack frames
allAuthenticatedAgents
java.lang.AssertionError: 1 expectation failed. Expected status code <200> but was <403>. at org.codehaus.groovy.runtime.callsite.ConstructorSite$ConstructorSiteNoUnwrap.callConstructor(ConstructorSite.java:84) at org.codehaus.groovy.runtime.callsite.AbstractCallSite.callConstructor(AbstractCallSite.java:247) at io.restassured.internal.ResponseSpecificationImpl$HamcrestAssertionClosure.validate(ResponseSpecificationImpl.groovy:483) at io.restassured.internal.ResponseSpecificationImpl$HamcrestAssertionClosure$validate$1.call(Unknown Source) at io.restassured.internal.ResponseSpecificationImpl.validateResponseIfRequired(ResponseSpecificationImpl.groovy:655) at org.codehaus.groovy.runtime.callsite.PogoMetaMethodSite$PogoCachedMethodSiteNoUnwrapNoCoerce.invoke(PogoMetaMethodSite.java:210) at org.codehaus.groovy.runtime.callsite.PogoMetaMethodSite.callCurrent(PogoMetaMethodSite.java:59) at org.codehaus.groovy.runtime.callsite.AbstractCallSite.callCurrent(AbstractCallSite.java:166) at io.restassured.internal.ResponseSpecificationImpl.statusCode(ResponseSpecificationImpl.groovy:123) at io.restassured.specification.ResponseSpecification$statusCode$0.callCurrent(Unknown Source) at io.restassured.internal.ResponseSpecificationImpl.statusCode(ResponseSpecificationImpl.groovy:131) at io.restassured.internal.ValidatableResponseOptionsImpl.statusCode(ValidatableResponseOptionsImpl.java:119) at org.fcrepo.spec.testsuite.AbstractTest.doGet(AbstractTest.java:390) at org.fcrepo.spec.testsuite.authz.WebACGeneral.allAuthenticatedAgents(WebACGeneral.java:166) at org.fcrepo.spec.testsuite.App.main(App.java:309) ... Removed 30 stack frames
resourceSingle
java.lang.AssertionError: 1 expectation failed. Expected status code <200> but was <403>. at org.codehaus.groovy.runtime.callsite.ConstructorSite$ConstructorSiteNoUnwrap.callConstructor(ConstructorSite.java:84) at org.codehaus.groovy.runtime.callsite.AbstractCallSite.callConstructor(AbstractCallSite.java:247) at io.restassured.internal.ResponseSpecificationImpl$HamcrestAssertionClosure.validate(ResponseSpecificationImpl.groovy:483) at io.restassured.internal.ResponseSpecificationImpl$HamcrestAssertionClosure$validate$1.call(Unknown Source) at io.restassured.internal.ResponseSpecificationImpl.validateResponseIfRequired(ResponseSpecificationImpl.groovy:655) at org.codehaus.groovy.runtime.callsite.PogoMetaMethodSite$PogoCachedMethodSiteNoUnwrapNoCoerce.invoke(PogoMetaMethodSite.java:210) at org.codehaus.groovy.runtime.callsite.PogoMetaMethodSite.callCurrent(PogoMetaMethodSite.java:59) at org.codehaus.groovy.runtime.callsite.AbstractCallSite.callCurrent(AbstractCallSite.java:166) at io.restassured.internal.ResponseSpecificationImpl.statusCode(ResponseSpecificationImpl.groovy:123) at io.restassured.specification.ResponseSpecification$statusCode$0.callCurrent(Unknown Source) at io.restassured.internal.ResponseSpecificationImpl.statusCode(ResponseSpecificationImpl.groovy:131) at io.restassured.internal.ValidatableResponseOptionsImpl.statusCode(ValidatableResponseOptionsImpl.java:119) at org.fcrepo.spec.testsuite.AbstractTest.doGet(AbstractTest.java:390) at org.fcrepo.spec.testsuite.authz.WebACGeneral.resourceSingle(WebACGeneral.java:191) at org.fcrepo.spec.testsuite.App.main(App.java:309) ... Removed 30 stack frames
org.fcrepo.spec.testsuite.crud.HttpPost
postDigestResponseHeaderAuthentication
java.lang.AssertionError: 1 expectation failed. Expected status code <409> but was <201>. at org.codehaus.groovy.runtime.callsite.ConstructorSite$ConstructorSiteNoUnwrap.callConstructor(ConstructorSite.java:84) at org.codehaus.groovy.runtime.callsite.AbstractCallSite.callConstructor(AbstractCallSite.java:247) at io.restassured.internal.ResponseSpecificationImpl$HamcrestAssertionClosure.validate(ResponseSpecificationImpl.groovy:483) at io.restassured.internal.ResponseSpecificationImpl$HamcrestAssertionClosure$validate$1.call(Unknown Source) at io.restassured.internal.ResponseSpecificationImpl.validateResponseIfRequired(ResponseSpecificationImpl.groovy:655) at org.codehaus.groovy.runtime.callsite.PogoMetaMethodSite$PogoCachedMethodSiteNoUnwrapNoCoerce.invoke(PogoMetaMethodSite.java:210) at org.codehaus.groovy.runtime.callsite.PogoMetaMethodSite.callCurrent(PogoMetaMethodSite.java:59) at org.codehaus.groovy.runtime.callsite.AbstractCallSite.callCurrent(AbstractCallSite.java:166) at io.restassured.internal.ResponseSpecificationImpl.statusCode(ResponseSpecificationImpl.groovy:123) at io.restassured.specification.ResponseSpecification$statusCode$0.callCurrent(Unknown Source) at io.restassured.internal.ResponseSpecificationImpl.statusCode(ResponseSpecificationImpl.groovy:131) at io.restassured.internal.ValidatableResponseOptionsImpl.statusCode(ValidatableResponseOptionsImpl.java:119) at org.fcrepo.spec.testsuite.crud.HttpPost.postDigestResponseHeaderAuthentication(HttpPost.java:102) at org.fcrepo.spec.testsuite.App.main(App.java:309) ... Removed 31 stack frames
org.fcrepo.spec.testsuite.versioning.LdprmHttpGet
ldpnrmMustHaveMementoLinkHeader
java.lang.AssertionError: Link header with a value of <http://mementoweb.org/ns#Memento>; rel="type" must be present but is not! expected [1] but found [0] at org.fcrepo.spec.testsuite.AbstractTest.confirmPresenceOfLinkValue(AbstractTest.java:561) at org.fcrepo.spec.testsuite.AbstractTest.confirmPresenceOfLinkValue(AbstractTest.java:557) at org.fcrepo.spec.testsuite.versioning.LdprmHttpGet.ldpnrmMustHaveMementoLinkHeader(LdprmHttpGet.java:168) at org.fcrepo.spec.testsuite.App.main(App.java:309) ... Removed 27 stack frames
ldprmMustHaveMementoLinkHeader
java.lang.AssertionError: Link header with a value of <http://mementoweb.org/ns#Memento>; rel="type" must be present but is not! expected [1] but found [0] at org.fcrepo.spec.testsuite.AbstractTest.confirmPresenceOfLinkValue(AbstractTest.java:561) at org.fcrepo.spec.testsuite.AbstractTest.confirmPresenceOfLinkValue(AbstractTest.java:557) at org.fcrepo.spec.testsuite.versioning.LdprmHttpGet.ldprmMustHaveMementoLinkHeader(LdprmHttpGet.java:147) at org.fcrepo.spec.testsuite.App.main(App.java:309) ... Removed 27 stack frames
org.fcrepo.spec.testsuite.crud.HttpDelete
httpDeleteStatusCheck
java.lang.AssertionError: null at org.fcrepo.spec.testsuite.crud.HttpDelete.httpDeleteStatusCheck(HttpDelete.java:167) at org.fcrepo.spec.testsuite.App.main(App.java:309) ... Removed 24 stack frames
httpDeleteStatusCheckTwo
java.lang.AssertionError: null at org.fcrepo.spec.testsuite.crud.HttpDelete.httpDeleteStatusCheckTwo(HttpDelete.java:246) at org.fcrepo.spec.testsuite.App.main(App.java:309) ... Removed 24 stack frames
org.fcrepo.spec.testsuite.crud.ExternalBinaryContent
unsupportedExternalBinaryContentConstraint
java.lang.AssertionError: Response does not contain a link of rel type = http://www.w3.org/ns/ldp#constrainedBy at org.fcrepo.spec.testsuite.AbstractTest.confirmPresenceOfConstrainedByLink(AbstractTest.java:591) at org.fcrepo.spec.testsuite.crud.ExternalBinaryContent.unsupportedExternalBinaryContentConstraint(ExternalBinaryContent.java:536) at org.fcrepo.spec.testsuite.App.main(App.java:309) ... Removed 23 stack frames
unsupportedExternalBinaryContentStatus
java.lang.AssertionError: 1 expectation failed. Expected status code (a value equal to or greater than <400> and a value less than <500>) but a value equal to or greater than <400> <201> was less than <400>. at org.codehaus.groovy.runtime.callsite.ConstructorSite$ConstructorSiteNoUnwrap.callConstructor(ConstructorSite.java:84) at org.codehaus.groovy.runtime.callsite.AbstractCallSite.callConstructor(AbstractCallSite.java:247) at io.restassured.internal.ResponseSpecificationImpl$HamcrestAssertionClosure.validate(ResponseSpecificationImpl.groovy:483) at io.restassured.internal.ResponseSpecificationImpl$HamcrestAssertionClosure$validate$1.call(Unknown Source) at io.restassured.internal.ResponseSpecificationImpl.validateResponseIfRequired(ResponseSpecificationImpl.groovy:655) at org.codehaus.groovy.runtime.callsite.PogoMetaMethodSite$PogoCachedMethodSiteNoUnwrapNoCoerce.invoke(PogoMetaMethodSite.java:210) at org.codehaus.groovy.runtime.callsite.PogoMetaMethodSite.callCurrent(PogoMetaMethodSite.java:59) at org.codehaus.groovy.runtime.callsite.AbstractCallSite.callCurrent(AbstractCallSite.java:166) at io.restassured.internal.ResponseSpecificationImpl.statusCode(ResponseSpecificationImpl.groovy:123) at io.restassured.internal.ValidatableResponseOptionsImpl.statusCode(ValidatableResponseOptionsImpl.java:114) at org.fcrepo.spec.testsuite.crud.ExternalBinaryContent.unsupportedExternalBinaryContentStatus(ExternalBinaryContent.java:514) at org.fcrepo.spec.testsuite.App.main(App.java:309) ... Removed 30 stack frames
org.fcrepo.spec.testsuite.versioning.LdprvHttpPut
ldpnrvMustSupportPUT
java.lang.IllegalArgumentException: path cannot be null at org.codehaus.groovy.runtime.callsite.ConstructorSite$ConstructorSiteNoUnwrap.callConstructor(ConstructorSite.java:84) at org.codehaus.groovy.runtime.callsite.CallSiteArray.defaultCallConstructor(CallSiteArray.java:60) at org.codehaus.groovy.runtime.callsite.AbstractCallSite.callConstructor(AbstractCallSite.java:235) at org.codehaus.groovy.runtime.callsite.AbstractCallSite.callConstructor(AbstractCallSite.java:247) at io.restassured.internal.assertion.AssertParameter.notNull(AssertParameter.groovy:26) at io.restassured.internal.assertion.AssertParameter$notNull.callStatic(Unknown Source) at org.codehaus.groovy.runtime.callsite.CallSiteArray.defaultCallStatic(CallSiteArray.java:56) at io.restassured.internal.assertion.AssertParameter$notNull.callStatic(Unknown Source) at io.restassured.internal.RequestSpecificationImpl.applyPathParamsAndSendRequest(RequestSpecificationImpl.groovy:1680) at groovy.lang.MetaMethod.doMethodInvoke(MetaMethod.java:325) at groovy.lang.MetaClassImpl.invokeMethod(MetaClassImpl.java:1213) at groovy.lang.MetaClassImpl.invokeMethod(MetaClassImpl.java:1022) at groovy.lang.MetaClassImpl.invokeMethod(MetaClassImpl.java:810) at io.restassured.internal.RequestSpecificationImpl.invokeMethod(RequestSpecificationImpl.groovy) at org.codehaus.groovy.runtime.callsite.PogoInterceptableSite.call(PogoInterceptableSite.java:48) at org.codehaus.groovy.runtime.callsite.PogoInterceptableSite.callCurrent(PogoInterceptableSite.java:58) at org.codehaus.groovy.runtime.callsite.AbstractCallSite.callCurrent(AbstractCallSite.java:182) at io.restassured.internal.RequestSpecificationImpl.applyPathParamsAndSendRequest(RequestSpecificationImpl.groovy:1738) at groovy.lang.MetaMethod.doMethodInvoke(MetaMethod.java:325) at groovy.lang.MetaClassImpl.invokeMethod(MetaClassImpl.java:1213) at groovy.lang.MetaClassImpl.invokeMethod(MetaClassImpl.java:1022) at groovy.lang.MetaClassImpl.invokeMethod(MetaClassImpl.java:810) at io.restassured.internal.RequestSpecificationImpl.invokeMethod(RequestSpecificationImpl.groovy) at org.codehaus.groovy.runtime.callsite.PogoInterceptableSite.call(PogoInterceptableSite.java:48) at org.codehaus.groovy.runtime.callsite.PogoInterceptableSite.callCurrent(PogoInterceptableSite.java:58) at org.codehaus.groovy.runtime.callsite.AbstractCallSite.callCurrent(AbstractCallSite.java:182) at io.restassured.internal.RequestSpecificationImpl.get(RequestSpecificationImpl.groovy:170) at io.restassured.internal.RequestSpecificationImpl.get(RequestSpecificationImpl.groovy) at org.fcrepo.spec.testsuite.AbstractTest.doGetUnverified(AbstractTest.java:408) at org.fcrepo.spec.testsuite.AbstractTest.doGet(AbstractTest.java:388) at org.fcrepo.spec.testsuite.AbstractTest.doGet(AbstractTest.java:396) at org.fcrepo.spec.testsuite.versioning.LdprvHttpPut.ldpnrvMustSupportPUT(LdprvHttpPut.java:140) at org.fcrepo.spec.testsuite.App.main(App.java:309) ... Removed 36 stack frames
ldpnrvMustSupportPUTForExistingResources
java.lang.IllegalArgumentException: path cannot be null at org.codehaus.groovy.runtime.callsite.ConstructorSite$ConstructorSiteNoUnwrap.callConstructor(ConstructorSite.java:84) at org.codehaus.groovy.runtime.callsite.AbstractCallSite.callConstructor(AbstractCallSite.java:247) at io.restassured.internal.assertion.AssertParameter.notNull(AssertParameter.groovy:26) at io.restassured.internal.assertion.AssertParameter$notNull.callStatic(Unknown Source) at org.codehaus.groovy.runtime.callsite.CallSiteArray.defaultCallStatic(CallSiteArray.java:56) at io.restassured.internal.assertion.AssertParameter$notNull.callStatic(Unknown Source) at io.restassured.internal.RequestSpecificationImpl.applyPathParamsAndSendRequest(RequestSpecificationImpl.groovy:1680) at groovy.lang.MetaMethod.doMethodInvoke(MetaMethod.java:325) at groovy.lang.MetaClassImpl.invokeMethod(MetaClassImpl.java:1213) at groovy.lang.MetaClassImpl.invokeMethod(MetaClassImpl.java:1022) at groovy.lang.MetaClassImpl.invokeMethod(MetaClassImpl.java:810) at io.restassured.internal.RequestSpecificationImpl.invokeMethod(RequestSpecificationImpl.groovy) at org.codehaus.groovy.runtime.callsite.PogoInterceptableSite.call(PogoInterceptableSite.java:48) at org.codehaus.groovy.runtime.callsite.PogoInterceptableSite.callCurrent(PogoInterceptableSite.java:58) at org.codehaus.groovy.runtime.callsite.AbstractCallSite.callCurrent(AbstractCallSite.java:182) at io.restassured.internal.RequestSpecificationImpl.applyPathParamsAndSendRequest(RequestSpecificationImpl.groovy:1738) at groovy.lang.MetaMethod.doMethodInvoke(MetaMethod.java:325) at groovy.lang.MetaClassImpl.invokeMethod(MetaClassImpl.java:1213) at groovy.lang.MetaClassImpl.invokeMethod(MetaClassImpl.java:1022) at groovy.lang.MetaClassImpl.invokeMethod(MetaClassImpl.java:810) at io.restassured.internal.RequestSpecificationImpl.invokeMethod(RequestSpecificationImpl.groovy) at org.codehaus.groovy.runtime.callsite.PogoInterceptableSite.call(PogoInterceptableSite.java:48) at org.codehaus.groovy.runtime.callsite.PogoInterceptableSite.callCurrent(PogoInterceptableSite.java:58) at org.codehaus.groovy.runtime.callsite.AbstractCallSite.callCurrent(AbstractCallSite.java:182) at io.restassured.internal.RequestSpecificationImpl.get(RequestSpecificationImpl.groovy:170) at io.restassured.internal.RequestSpecificationImpl.get(RequestSpecificationImpl.groovy) at org.fcrepo.spec.testsuite.AbstractTest.doGetUnverified(AbstractTest.java:408) at org.fcrepo.spec.testsuite.AbstractTest.doGet(AbstractTest.java:388) at org.fcrepo.spec.testsuite.AbstractTest.doGet(AbstractTest.java:396) at org.fcrepo.spec.testsuite.versioning.LdprvHttpPut.ldpnrvMustSupportPUTForExistingResources(LdprvHttpPut.java:160) at org.fcrepo.spec.testsuite.App.main(App.java:309) ... Removed 36 stack frames
ldprvMustSupportPUT
java.lang.IllegalArgumentException: path cannot be null at org.codehaus.groovy.runtime.callsite.ConstructorSite$ConstructorSiteNoUnwrap.callConstructor(ConstructorSite.java:84) at org.codehaus.groovy.runtime.callsite.AbstractCallSite.callConstructor(AbstractCallSite.java:247) at io.restassured.internal.assertion.AssertParameter.notNull(AssertParameter.groovy:26) at io.restassured.internal.assertion.AssertParameter$notNull.callStatic(Unknown Source) at org.codehaus.groovy.runtime.callsite.CallSiteArray.defaultCallStatic(CallSiteArray.java:56) at io.restassured.internal.assertion.AssertParameter$notNull.callStatic(Unknown Source) at io.restassured.internal.RequestSpecificationImpl.applyPathParamsAndSendRequest(RequestSpecificationImpl.groovy:1680) at groovy.lang.MetaMethod.doMethodInvoke(MetaMethod.java:325) at groovy.lang.MetaClassImpl.invokeMethod(MetaClassImpl.java:1213) at groovy.lang.MetaClassImpl.invokeMethod(MetaClassImpl.java:1022) at groovy.lang.MetaClassImpl.invokeMethod(MetaClassImpl.java:810) at io.restassured.internal.RequestSpecificationImpl.invokeMethod(RequestSpecificationImpl.groovy) at org.codehaus.groovy.runtime.callsite.PogoInterceptableSite.call(PogoInterceptableSite.java:48) at org.codehaus.groovy.runtime.callsite.PogoInterceptableSite.callCurrent(PogoInterceptableSite.java:58) at org.codehaus.groovy.runtime.callsite.AbstractCallSite.callCurrent(AbstractCallSite.java:182) at io.restassured.internal.RequestSpecificationImpl.applyPathParamsAndSendRequest(RequestSpecificationImpl.groovy:1738) at groovy.lang.MetaMethod.doMethodInvoke(MetaMethod.java:325) at groovy.lang.MetaClassImpl.invokeMethod(MetaClassImpl.java:1213) at groovy.lang.MetaClassImpl.invokeMethod(MetaClassImpl.java:1022) at groovy.lang.MetaClassImpl.invokeMethod(MetaClassImpl.java:810) at io.restassured.internal.RequestSpecificationImpl.invokeMethod(RequestSpecificationImpl.groovy) at org.codehaus.groovy.runtime.callsite.PogoInterceptableSite.call(PogoInterceptableSite.java:48) at org.codehaus.groovy.runtime.callsite.PogoInterceptableSite.callCurrent(PogoInterceptableSite.java:58) at org.codehaus.groovy.runtime.callsite.AbstractCallSite.callCurrent(AbstractCallSite.java:182) at io.restassured.internal.RequestSpecificationImpl.get(RequestSpecificationImpl.groovy:170) at io.restassured.internal.RequestSpecificationImpl.get(RequestSpecificationImpl.groovy) at org.fcrepo.spec.testsuite.AbstractTest.doGetUnverified(AbstractTest.java:408) at org.fcrepo.spec.testsuite.AbstractTest.doGet(AbstractTest.java:388) at org.fcrepo.spec.testsuite.AbstractTest.doGet(AbstractTest.java:396) at org.fcrepo.spec.testsuite.versioning.LdprvHttpPut.ldprvMustSupportPUT(LdprvHttpPut.java:83) at org.fcrepo.spec.testsuite.App.main(App.java:309) ... Removed 36 stack frames
ldprvMustSupportPUTForExistingResources
java.lang.IllegalArgumentException: path cannot be null at org.codehaus.groovy.runtime.callsite.ConstructorSite$ConstructorSiteNoUnwrap.callConstructor(ConstructorSite.java:84) at org.codehaus.groovy.runtime.callsite.AbstractCallSite.callConstructor(AbstractCallSite.java:247) at io.restassured.internal.assertion.AssertParameter.notNull(AssertParameter.groovy:26) at io.restassured.internal.assertion.AssertParameter$notNull.callStatic(Unknown Source) at org.codehaus.groovy.runtime.callsite.CallSiteArray.defaultCallStatic(CallSiteArray.java:56) at io.restassured.internal.assertion.AssertParameter$notNull.callStatic(Unknown Source) at io.restassured.internal.RequestSpecificationImpl.applyPathParamsAndSendRequest(RequestSpecificationImpl.groovy:1680) at groovy.lang.MetaMethod.doMethodInvoke(MetaMethod.java:325) at groovy.lang.MetaClassImpl.invokeMethod(MetaClassImpl.java:1213) at groovy.lang.MetaClassImpl.invokeMethod(MetaClassImpl.java:1022) at groovy.lang.MetaClassImpl.invokeMethod(MetaClassImpl.java:810) at io.restassured.internal.RequestSpecificationImpl.invokeMethod(RequestSpecificationImpl.groovy) at org.codehaus.groovy.runtime.callsite.PogoInterceptableSite.call(PogoInterceptableSite.java:48) at org.codehaus.groovy.runtime.callsite.PogoInterceptableSite.callCurrent(PogoInterceptableSite.java:58) at org.codehaus.groovy.runtime.callsite.AbstractCallSite.callCurrent(AbstractCallSite.java:182) at io.restassured.internal.RequestSpecificationImpl.applyPathParamsAndSendRequest(RequestSpecificationImpl.groovy:1738) at groovy.lang.MetaMethod.doMethodInvoke(MetaMethod.java:325) at groovy.lang.MetaClassImpl.invokeMethod(MetaClassImpl.java:1213) at groovy.lang.MetaClassImpl.invokeMethod(MetaClassImpl.java:1022) at groovy.lang.MetaClassImpl.invokeMethod(MetaClassImpl.java:810) at io.restassured.internal.RequestSpecificationImpl.invokeMethod(RequestSpecificationImpl.groovy) at org.codehaus.groovy.runtime.callsite.PogoInterceptableSite.call(PogoInterceptableSite.java:48) at org.codehaus.groovy.runtime.callsite.PogoInterceptableSite.callCurrent(PogoInterceptableSite.java:58) at org.codehaus.groovy.runtime.callsite.AbstractCallSite.callCurrent(AbstractCallSite.java:182) at io.restassured.internal.RequestSpecificationImpl.get(RequestSpecificationImpl.groovy:170) at io.restassured.internal.RequestSpecificationImpl.get(RequestSpecificationImpl.groovy) at org.fcrepo.spec.testsuite.AbstractTest.doGetUnverified(AbstractTest.java:400) at org.fcrepo.spec.testsuite.AbstractTest.doGet(AbstractTest.java:380) at org.fcrepo.spec.testsuite.versioning.LdprvHttpPut.ldprvMustSupportPUTForExistingResources(LdprvHttpPut.java:104) at org.fcrepo.spec.testsuite.App.main(App.java:309) ... Removed 36 stack frames
org.fcrepo.spec.testsuite.authz.WebACCrossDomain
rejectRemoteAclStatus
java.lang.AssertionError: 1 expectation failed. Expected status code <201> but was <409>. at org.codehaus.groovy.runtime.callsite.ConstructorSite$ConstructorSiteNoUnwrap.callConstructor(ConstructorSite.java:84) at org.codehaus.groovy.runtime.callsite.AbstractCallSite.callConstructor(AbstractCallSite.java:247) at io.restassured.internal.ResponseSpecificationImpl$HamcrestAssertionClosure.validate(ResponseSpecificationImpl.groovy:483) at io.restassured.internal.ResponseSpecificationImpl$HamcrestAssertionClosure$validate$1.call(Unknown Source) at io.restassured.internal.ResponseSpecificationImpl.validateResponseIfRequired(ResponseSpecificationImpl.groovy:655) at org.codehaus.groovy.runtime.callsite.PogoMetaMethodSite$PogoCachedMethodSiteNoUnwrapNoCoerce.invoke(PogoMetaMethodSite.java:210) at org.codehaus.groovy.runtime.callsite.PogoMetaMethodSite.callCurrent(PogoMetaMethodSite.java:59) at org.codehaus.groovy.runtime.callsite.AbstractCallSite.callCurrent(AbstractCallSite.java:166) at io.restassured.internal.ResponseSpecificationImpl.statusCode(ResponseSpecificationImpl.groovy:123) at io.restassured.specification.ResponseSpecification$statusCode$0.callCurrent(Unknown Source) at io.restassured.internal.ResponseSpecificationImpl.statusCode(ResponseSpecificationImpl.groovy:131) at io.restassured.internal.ValidatableResponseOptionsImpl.statusCode(ValidatableResponseOptionsImpl.java:119) at org.fcrepo.spec.testsuite.AbstractTest.createBasicContainer(AbstractTest.java:189) at org.fcrepo.spec.testsuite.AbstractTest.createBasicContainer(AbstractTest.java:179) at org.fcrepo.spec.testsuite.authz.AbstractAuthzTest.isClientAclLinkingSupported(AbstractAuthzTest.java:90) at org.fcrepo.spec.testsuite.authz.WebACCrossDomain.createResourceWithRemoteAcl(WebACCrossDomain.java:57) at org.fcrepo.spec.testsuite.authz.WebACCrossDomain.rejectRemoteAclStatus(WebACCrossDomain.java:79) at org.fcrepo.spec.testsuite.App.main(App.java:309) ... Removed 30 stack frames
org.fcrepo.spec.testsuite.authz.WebACDefaultACLs
aclInheritanceMustUseLdpContainmentRelationships
java.lang.AssertionError: 1 expectation failed. Expected status code <200> but was <403>. at org.codehaus.groovy.runtime.callsite.ConstructorSite$ConstructorSiteNoUnwrap.callConstructor(ConstructorSite.java:84) at org.codehaus.groovy.runtime.callsite.AbstractCallSite.callConstructor(AbstractCallSite.java:247) at io.restassured.internal.ResponseSpecificationImpl$HamcrestAssertionClosure.validate(ResponseSpecificationImpl.groovy:483) at io.restassured.internal.ResponseSpecificationImpl$HamcrestAssertionClosure$validate$1.call(Unknown Source) at io.restassured.internal.ResponseSpecificationImpl.validateResponseIfRequired(ResponseSpecificationImpl.groovy:655) at org.codehaus.groovy.runtime.callsite.PogoMetaMethodSite$PogoCachedMethodSiteNoUnwrapNoCoerce.invoke(PogoMetaMethodSite.java:210) at org.codehaus.groovy.runtime.callsite.PogoMetaMethodSite.callCurrent(PogoMetaMethodSite.java:59) at org.codehaus.groovy.runtime.callsite.AbstractCallSite.callCurrent(AbstractCallSite.java:166) at io.restassured.internal.ResponseSpecificationImpl.statusCode(ResponseSpecificationImpl.groovy:123) at io.restassured.specification.ResponseSpecification$statusCode$0.callCurrent(Unknown Source) at io.restassured.internal.ResponseSpecificationImpl.statusCode(ResponseSpecificationImpl.groovy:131) at io.restassured.internal.ValidatableResponseOptionsImpl.statusCode(ValidatableResponseOptionsImpl.java:119) at org.fcrepo.spec.testsuite.AbstractTest.doGet(AbstractTest.java:390) at org.fcrepo.spec.testsuite.authz.WebACDefaultACLs.aclInheritanceMustUseLdpContainmentRelationships(WebACDefaultACLs.java:67) at org.fcrepo.spec.testsuite.App.main(App.java:309) ... Removed 30 stack frames
org.fcrepo.spec.testsuite.versioning.LdpcvHttpGet
ldpcvMustHaveContainerLinkHeader
java.lang.AssertionError: Link header with a value of <http://www.w3.org/ns/ldp#Container>; rel="type" must be present but is not! expected [1] but found [0] at org.fcrepo.spec.testsuite.AbstractTest.confirmPresenceOfLinkValue(AbstractTest.java:561) at org.fcrepo.spec.testsuite.AbstractTest.confirmPresenceOfLinkValue(AbstractTest.java:557) at org.fcrepo.spec.testsuite.versioning.LdpcvHttpGet.ldpcvMustHaveContainerLinkHeader(LdpcvHttpGet.java:158) at org.fcrepo.spec.testsuite.App.main(App.java:309) ... Removed 27 stack frames
ldpcvMustHaveTimeMapLinkHeader
java.lang.AssertionError: Link header with a value of <http://mementoweb.org/ns#TimeMap>; rel="type" must be present but is not! expected [1] but found [0] at org.fcrepo.spec.testsuite.AbstractTest.confirmPresenceOfLinkValue(AbstractTest.java:561) at org.fcrepo.spec.testsuite.AbstractTest.confirmPresenceOfLinkValue(AbstractTest.java:557) at org.fcrepo.spec.testsuite.versioning.LdpcvHttpGet.ldpcvMustHaveTimeMapLinkHeader(LdpcvHttpGet.java:63) at org.fcrepo.spec.testsuite.App.main(App.java:309) ... Removed 27 stack frames
org.fcrepo.spec.testsuite.versioning.ResourceVersioning
postLdprWithType
java.lang.AssertionError: Link header with a value of <http://mementoweb.org/ns#OriginalResource>; rel="type" must be present but is not! expected [1] but found [0] at org.fcrepo.spec.testsuite.AbstractTest.confirmPresenceOfLinkValue(AbstractTest.java:561) at org.fcrepo.spec.testsuite.AbstractTest.confirmPresenceOfLinkValue(AbstractTest.java:557) at org.fcrepo.spec.testsuite.versioning.ResourceVersioning.postLdprWithType(ResourceVersioning.java:52) at org.fcrepo.spec.testsuite.App.main(App.java:309) ... Removed 27 stack frames
org.fcrepo.spec.testsuite.versioning.LdprmHttpDelete
ldprmMustSupportDeleteIfAdvertised
org.testng.SkipException: DELETE not supported at org.fcrepo.spec.testsuite.versioning.LdprmHttpDelete.ldprmMustSupportDeleteIfAdvertised(LdprmHttpDelete.java:57) at org.fcrepo.spec.testsuite.App.main(App.java:309) ... Removed 22 stack frames
org.fcrepo.spec.testsuite.crud.ExternalBinaryContent
binaryContentGuaranteeHeaders
org.testng.SkipException: External Binaries are NOT supported at org.fcrepo.spec.testsuite.crud.ExternalBinaryContent.binaryContentGuaranteeHeaders(ExternalBinaryContent.java:781) at org.fcrepo.spec.testsuite.App.main(App.java:309) ... Removed 22 stack frames
binaryContentMediaType
org.testng.SkipException: External Binaries are NOT supported at org.fcrepo.spec.testsuite.crud.ExternalBinaryContent.binaryContentMediaType(ExternalBinaryContent.java:631) at org.fcrepo.spec.testsuite.App.main(App.java:309) ... Removed 22 stack frames
binaryContentOptions
org.testng.SkipException: External Binaries are NOT supported at org.fcrepo.spec.testsuite.crud.ExternalBinaryContent.binaryContentOptions(ExternalBinaryContent.java:809) at org.fcrepo.spec.testsuite.App.main(App.java:309) ... Removed 22 stack frames
binaryContentProxyWantDigest
org.testng.SkipException: External Binaries are NOT supported at org.fcrepo.spec.testsuite.crud.ExternalBinaryContent.binaryContentProxyWantDigest(ExternalBinaryContent.java:852) at org.fcrepo.spec.testsuite.App.main(App.java:309) ... Removed 22 stack frames
binaryContentRedirectStatusGet
org.testng.SkipException: External Binaries are NOT supported at org.fcrepo.spec.testsuite.crud.ExternalBinaryContent.binaryContentRedirectStatusGet(ExternalBinaryContent.java:877) at org.fcrepo.spec.testsuite.App.main(App.java:309) ... Removed 22 stack frames
binaryContentRedirectStatusHead
org.testng.SkipException: External Binaries are NOT supported at org.fcrepo.spec.testsuite.crud.ExternalBinaryContent.binaryContentRedirectStatusHead(ExternalBinaryContent.java:900) at org.fcrepo.spec.testsuite.App.main(App.java:309) ... Removed 22 stack frames
binaryContentRedirectWantDigest
org.testng.SkipException: External Binaries are NOT supported at org.fcrepo.spec.testsuite.crud.ExternalBinaryContent.binaryContentRedirectWantDigest(ExternalBinaryContent.java:827) at org.fcrepo.spec.testsuite.App.main(App.java:309) ... Removed 22 stack frames
externalBinaryContentHandlingAttribute
org.testng.SkipException: External Binaries are NOT supported at org.fcrepo.spec.testsuite.crud.ExternalBinaryContent.externalBinaryContentHandlingAttribute(ExternalBinaryContent.java:551) at org.fcrepo.spec.testsuite.App.main(App.java:309) ... Removed 22 stack frames
externalBinaryContentHandlingStatus
org.testng.SkipException: External Binaries are NOT supported at org.fcrepo.spec.testsuite.crud.ExternalBinaryContent.externalBinaryContentHandlingStatus(ExternalBinaryContent.java:584) at org.fcrepo.spec.testsuite.App.main(App.java:309) ... Removed 22 stack frames
unsupportedBinaryContentHandlingAttribute
org.testng.SkipException: External Binaries are NOT supported at org.fcrepo.spec.testsuite.crud.ExternalBinaryContent.unsupportedBinaryContentHandlingAttribute(ExternalBinaryContent.java:608) at org.fcrepo.spec.testsuite.App.main(App.java:309) ... Removed 22 stack frames
org.fcrepo.spec.testsuite.crud.Container
ldpDirectContainerMustAllowHasMemberRelationPredicateToBeSetOnCreate
org.testng.SkipException: This implementation does not support DirectContainers at org.fcrepo.spec.testsuite.crud.Container.skipIfDirectContainersNotSupported(Container.java:109) at org.fcrepo.spec.testsuite.crud.Container.ldpDirectContainerMustAllowHasMemberRelationPredicateToBeSetOnCreate(Container.java:537) at org.fcrepo.spec.testsuite.App.main(App.java:309) ... Removed 22 stack frames
ldpDirectContainerMustAllowIsMemberOfRelationPredicateToBeSetOnCreate
org.testng.SkipException: This implementation does not support DirectContainers at org.fcrepo.spec.testsuite.crud.Container.skipIfDirectContainersNotSupported(Container.java:109) at org.fcrepo.spec.testsuite.crud.Container.ldpDirectContainerMustAllowIsMemberOfRelationPredicateToBeSetOnCreate(Container.java:564) at org.fcrepo.spec.testsuite.App.main(App.java:309) ... Removed 22 stack frames
ldpDirectContainerMustAllowMembershipConstantURIToBeSet
org.testng.SkipException: This implementation does not support DirectContainers at org.fcrepo.spec.testsuite.crud.Container.skipIfDirectContainersNotSupported(Container.java:109) at org.fcrepo.spec.testsuite.crud.Container.ldpDirectContainerMustAllowMembershipConstantURIToBeSet(Container.java:378) at org.fcrepo.spec.testsuite.App.main(App.java:309) ... Removed 22 stack frames
ldpDirectContainerMustAllowMembershipPredicateToBeSetByDefault
org.testng.SkipException: This implementation does not support DirectContainers at org.fcrepo.spec.testsuite.crud.Container.skipIfDirectContainersNotSupported(Container.java:109) at org.fcrepo.spec.testsuite.crud.Container.ldpDirectContainerMustAllowMembershipPredicateToBeSetByDefault(Container.java:588) at org.fcrepo.spec.testsuite.App.main(App.java:309) ... Removed 22 stack frames
ldpDirectContainerMustSetLdpMembershipResourceByDefault
org.testng.SkipException: This implementation does not support DirectContainers at org.fcrepo.spec.testsuite.crud.Container.skipIfDirectContainersNotSupported(Container.java:109) at org.fcrepo.spec.testsuite.crud.Container.ldpDirectContainerMustSetLdpMembershipResourceByDefault(Container.java:402) at org.fcrepo.spec.testsuite.App.main(App.java:309) ... Removed 22 stack frames
ldpIndirectContainerMustAllowHasMemberRelationPredicateToBeSetOnCreate
org.testng.SkipException: This implementation does not support IndirectContainers at org.fcrepo.spec.testsuite.crud.Container.skipIfIndirectContainersNotSupported(Container.java:122) at org.fcrepo.spec.testsuite.crud.Container.ldpIndirectContainerMustAllowHasMemberRelationPredicateToBeSetOnCreate(Container.java:963) at org.fcrepo.spec.testsuite.App.main(App.java:309) ... Removed 22 stack frames
ldpIndirectContainerMustAllowInsertedContentRelationPredicateToBeSetOnCreate
org.testng.SkipException: This implementation does not support IndirectContainers at org.fcrepo.spec.testsuite.crud.Container.skipIfIndirectContainersNotSupported(Container.java:122) at org.fcrepo.spec.testsuite.crud.Container.ldpIndirectContainerMustAllowInsertedContentRelationPredicateToBeSetOnCreate(Container.java:1236) at org.fcrepo.spec.testsuite.App.main(App.java:309) ... Removed 22 stack frames
ldpIndirectContainerMustAllowInsertedContentRelationToBeSetByDefault
org.testng.SkipException: This implementation does not support IndirectContainers at org.fcrepo.spec.testsuite.crud.Container.skipIfIndirectContainersNotSupported(Container.java:122) at org.fcrepo.spec.testsuite.crud.Container.ldpIndirectContainerMustAllowInsertedContentRelationToBeSetByDefault(Container.java:1264) at org.fcrepo.spec.testsuite.App.main(App.java:309) ... Removed 22 stack frames
ldpIndirectContainerMustAllowIsMemberOfRelationPredicateToBeSetOnCreate
org.testng.SkipException: This implementation does not support IndirectContainers at org.fcrepo.spec.testsuite.crud.Container.skipIfIndirectContainersNotSupported(Container.java:122) at org.fcrepo.spec.testsuite.crud.Container.ldpIndirectContainerMustAllowIsMemberOfRelationPredicateToBeSetOnCreate(Container.java:989) at org.fcrepo.spec.testsuite.App.main(App.java:309) ... Removed 22 stack frames
ldpIndirectContainerMustAllowMembershipConstantURIToBeSet
org.testng.SkipException: This implementation does not support IndirectContainers at org.fcrepo.spec.testsuite.crud.Container.skipIfIndirectContainersNotSupported(Container.java:122) at org.fcrepo.spec.testsuite.crud.Container.ldpIndirectContainerMustAllowMembershipConstantURIToBeSet(Container.java:812) at org.fcrepo.spec.testsuite.App.main(App.java:309) ... Removed 22 stack frames
ldpIndirectContainerMustAllowMembershipPredicateToBeSetByDefault
org.testng.SkipException: This implementation does not support IndirectContainers at org.fcrepo.spec.testsuite.crud.Container.skipIfIndirectContainersNotSupported(Container.java:122) at org.fcrepo.spec.testsuite.crud.Container.ldpIndirectContainerMustAllowMembershipPredicateToBeSetByDefault(Container.java:1014) at org.fcrepo.spec.testsuite.App.main(App.java:309) ... Removed 22 stack frames
ldpIndirectContainerMustSetLdpMembershipResourceByDefault
org.testng.SkipException: This implementation does not support IndirectContainers at org.fcrepo.spec.testsuite.crud.Container.skipIfIndirectContainersNotSupported(Container.java:122) at org.fcrepo.spec.testsuite.crud.Container.ldpIndirectContainerMustSetLdpMembershipResourceByDefault(Container.java:839) at org.fcrepo.spec.testsuite.App.main(App.java:309) ... Removed 22 stack frames
ldpcMembershipTriples
org.testng.SkipException: This implementation does not support DirectContainers at org.fcrepo.spec.testsuite.crud.Container.skipIfDirectContainersNotSupported(Container.java:109) at org.fcrepo.spec.testsuite.crud.Container.ldpcMembershipTriples(Container.java:193) at org.fcrepo.spec.testsuite.App.main(App.java:309) ... Removed 22 stack frames
org.fcrepo.spec.testsuite.crud.StateToken
badStateTokenOnPatchWhenStateTokensSupported
org.testng.SkipException: This implementation does not support X-State-Token at org.fcrepo.spec.testsuite.crud.StateToken.skipIfStateTokenNotSupported(StateToken.java:68) at org.fcrepo.spec.testsuite.crud.StateToken.badStateTokenOnPatchWhenStateTokensSupported(StateToken.java:172) at org.fcrepo.spec.testsuite.App.main(App.java:309) ... Removed 22 stack frames
badStateTokenOnPutWhenStateTokensSupported
org.testng.SkipException: This implementation does not support X-State-Token at org.fcrepo.spec.testsuite.crud.StateToken.skipIfStateTokenNotSupported(StateToken.java:68) at org.fcrepo.spec.testsuite.crud.StateToken.badStateTokenOnPutWhenStateTokensSupported(StateToken.java:252) at org.fcrepo.spec.testsuite.App.main(App.java:309) ... Removed 22 stack frames
goodStateTokenOnPatchWhenStateTokensSupported
org.testng.SkipException: This implementation does not support X-State-Token at org.fcrepo.spec.testsuite.crud.StateToken.skipIfStateTokenNotSupported(StateToken.java:68) at org.fcrepo.spec.testsuite.crud.StateToken.goodStateTokenOnPatchWhenStateTokensSupported(StateToken.java:119) at org.fcrepo.spec.testsuite.App.main(App.java:309) ... Removed 22 stack frames
goodStateTokenOnPutSucceedsWhenStateTokensSupported
org.testng.SkipException: This implementation does not support X-State-Token at org.fcrepo.spec.testsuite.crud.StateToken.skipIfStateTokenNotSupported(StateToken.java:68) at org.fcrepo.spec.testsuite.crud.StateToken.goodStateTokenOnPutSucceedsWhenStateTokensSupported(StateToken.java:199) at org.fcrepo.spec.testsuite.App.main(App.java:309) ... Removed 22 stack frames
org.fcrepo.spec.testsuite.authz.WebACCrossDomain
rejectRemoteAclConstraint
org.testng.SkipException: Client specified ACL locations not supported. at org.fcrepo.spec.testsuite.authz.WebACCrossDomain.createResourceWithRemoteAcl(WebACCrossDomain.java:58) at org.fcrepo.spec.testsuite.authz.WebACCrossDomain.rejectRemoteAclConstraint(WebACCrossDomain.java:98) at org.fcrepo.spec.testsuite.App.main(App.java:309) ... Removed 22 stack frames
rejectRemoteGroupConstraint
org.testng.SkipException: Implementation does not reject requests concerning remote Group Listings. at org.fcrepo.spec.testsuite.authz.WebACCrossDomain.rejectRemoteGroupConstraint(WebACCrossDomain.java:179) at org.fcrepo.spec.testsuite.App.main(App.java:309) ... Removed 22 stack frames
rejectRemoteGroupStatus
org.testng.SkipException: Implementation does not reject requests concerning remote Group Listings. at org.fcrepo.spec.testsuite.authz.WebACCrossDomain.rejectRemoteGroupStatus(WebACCrossDomain.java:157) at org.fcrepo.spec.testsuite.App.main(App.java:309) ... Removed 22 stack frames
org.fcrepo.spec.testsuite.versioning.LdprvHttpGet
ldpvGetMustReturnHeaderOriginalTypeLink
ldpvGetMustReturnHeaderTimeGateTypeLink
ldpvGetMustReturnTimeMapLink
ldpvGetMustReturnVaryHeader
org.fcrepo.spec.testsuite.crud.HttpGet
responseDescribesHeader
responsePreferenceAppliedHeader
org.fcrepo.spec.testsuite.authz.WebACRepresentation
accessDenied
onlyAuthorizationStatementsUsed
org.fcrepo.spec.testsuite.authz.WebACModes
appendDisallowed
appendNotWriteLdpNr
appendNotWriteLdpRsMust
controlDisallowedGET
controlDisallowedPATCH
readDisallowed
writeDisallowedDelete
writeDisallowedPatch
writeDisallowedPost
writeDisallowedPut
org.fcrepo.spec.testsuite.crud.Container
createLDPC
ldpcContainmentTriples
ldpcMinimalContainerTriples
org.fcrepo.spec.testsuite.crud.HttpOptions
httpOptionsSupport
httpOptionsSupportAllow
org.fcrepo.spec.testsuite.crud.HttpHead
httpHeadResponseDigest
httpHeadResponseNoBody
org.fcrepo.spec.testsuite.authz.WebACLinkHeaders
linkToAclExisting
linkToAclNonexisting
org.fcrepo.spec.testsuite.versioning.LdpcvHttpOptions
ldpcvMustReturnAcceptPatchHeaderIfPatchIsSupported
ldpcvMustReturnAcceptPostHeaderIfPostIsSupported
ldpcvMustSupportOptions
ldpcvOptionsMustAllowHeadGetOptions
org.fcrepo.spec.testsuite.crud.HttpPut
httpPutNR
httpPutUpdateTriples
putNonRDFSourceCreateLDPRS
org.fcrepo.spec.testsuite.authz.WebACRdfSources
aclIsLDPRS
org.fcrepo.spec.testsuite.crud.HttpPatch
disallowPatchContainmentTriples
serverManagedPropertiesModification
statementNotPersistedResponseBody
successfulPatchStatusCode
supportPatch
org.fcrepo.spec.testsuite.event.NotificationTest
testCatchMessage
testEventSerialization
org.fcrepo.spec.testsuite.versioning.LdprmHttpGet
ldpnrmMustHaveCorrectTimeGate
ldpnrmMustSupportGet
ldprmMustHaveCorrectTimeGate
ldprmMustSupportGet
org.fcrepo.spec.testsuite.crud.HttpPost
httpPost
postNonRDFSource
postResourceAndCheckAssociatedResource
org.fcrepo.spec.testsuite.versioning.LdprmHttpOptions
ldprmMustNotSupportPatch
ldprmMustNotSupportPost
ldprmMustNotSupportPut
ldprmMustSupportOptions
ldprmOptionsMustSupportGetHeadAndOptions
org.fcrepo.spec.testsuite.versioning.LdpcvHttpGet
ldpcvMustIncludeAcceptPatchIfPatchAllowed
ldpcvMustIncludeAcceptPostIfPostAllowed
ldpcvMustRespondToGetWithApplicationLinkAcceptHeader
ldpcvMustSupportGet
lpcvMustIncludeAllowHeader
Default testng.xml
<?xml version="1.0" encoding="UTF-8"?>
<!DOCTYPE suite SYSTEM "http://testng.org/testng-1.0.dtd">
<suite guice-stage="DEVELOPMENT" name="Fedora API Specification Test Suite">
  <listeners>
    <listener class-name="org.fcrepo.spec.testsuite.report.HtmlReporter"/>
    <listener class-name="org.fcrepo.spec.testsuite.report.EarlReporter"/>
  </listeners>
  <test name="Fedora API Specification Tests">
    <groups>
      <define name="all">
        <include name="MUST"/>
        <include name="SHOULD"/>
        <include name="MAY"/>
        <include name="MUST NOT"/>
        <include name="SHOULD NOT"/>
      </define> <!-- all -->
      <define name="mustnot">
        <include name="MUST NOT"/>
      </define> <!-- mustnot -->
      <define name="shouldnot">
        <include name="SHOULD NOT"/>
      </define> <!-- shouldnot -->
      <define name="may">
        <include name="MAY"/>
      </define> <!-- may -->
      <define name="should">
        <include name="SHOULD"/>
      </define> <!-- should -->
      <define name="must">
        <include name="MUST"/>
      </define> <!-- must -->
      <run>
        <include name="must"/>
      </run>
    </groups>
    <classes>
      <class name="org.fcrepo.spec.testsuite.crud.Container"/>
      <class name="org.fcrepo.spec.testsuite.crud.Ldpnr"/>
      <class name="org.fcrepo.spec.testsuite.crud.HttpGet"/>
      <class name="org.fcrepo.spec.testsuite.crud.HttpHead"/>
      <class name="org.fcrepo.spec.testsuite.crud.HttpOptions"/>
      <class name="org.fcrepo.spec.testsuite.crud.HttpPost"/>
      <class name="org.fcrepo.spec.testsuite.crud.HttpPut"/>
      <class name="org.fcrepo.spec.testsuite.crud.HttpPatch"/>
      <class name="org.fcrepo.spec.testsuite.crud.HttpDelete"/>
      <class name="org.fcrepo.spec.testsuite.crud.ExternalBinaryContent"/>
      <class name="org.fcrepo.spec.testsuite.crud.StateToken"/>
      <class name="org.fcrepo.spec.testsuite.versioning.LdprvHttpGet"/>
      <class name="org.fcrepo.spec.testsuite.versioning.LdprvHttpPut"/>
      <class name="org.fcrepo.spec.testsuite.versioning.LdprmHttpGet"/>
      <class name="org.fcrepo.spec.testsuite.versioning.LdprmHttpDelete"/>
      <class name="org.fcrepo.spec.testsuite.versioning.LdprmHttpOptions"/>
      <class name="org.fcrepo.spec.testsuite.versioning.LdpcvHttpGet"/>
      <class name="org.fcrepo.spec.testsuite.versioning.LdpcvHttpPost"/>
      <class name="org.fcrepo.spec.testsuite.versioning.LdpcvHttpDelete"/>
      <class name="org.fcrepo.spec.testsuite.versioning.LdpcvHttpOptions"/>
      <class name="org.fcrepo.spec.testsuite.versioning.ResourceVersioning"/>
      <class name="org.fcrepo.spec.testsuite.authz.WebACLinking"/>
      <class name="org.fcrepo.spec.testsuite.authz.WebACModes"/>
      <class name="org.fcrepo.spec.testsuite.authz.WebACLinkHeaders"/>
      <class name="org.fcrepo.spec.testsuite.authz.WebACRepresentation"/>
      <class name="org.fcrepo.spec.testsuite.authz.WebACRdfSources"/>
      <class name="org.fcrepo.spec.testsuite.authz.WebACGeneral"/>
      <class name="org.fcrepo.spec.testsuite.authz.WebACDefaultACLs"/>
      <class name="org.fcrepo.spec.testsuite.authz.WebACAccessToClass"/>
      <class name="org.fcrepo.spec.testsuite.authz.WebACCrossDomain"/>
      <class name="org.fcrepo.spec.testsuite.event.NotificationTest"/>
    </classes>
  </test> <!-- Fedora API Specification Tests -->
</suite> <!-- Fedora API Specification Test Suite -->
            
Tests for Fedora API Specification Test Suite
  • Fedora API Specification Tests (31 classes)
Groups for Fedora API Specification Test Suite
MUST
accessDenied
accessToClassMustGiveAccessToBinary
accessToClassMustGiveAccessToContainer
aclExamined
aclInheritanceMustUseLdpContainmentRelationships
aclIsLDPRS
aclRepresentation
agentAll
agentDouble
agentGroup
agentGroupWithHashUris
agentSingle
allAuthenticatedAgents
appendAllowedPATCH
appendAllowedPOST
appendDisallowed
appendNotWriteLdpCMust
appendNotWriteLdpNr
appendNotWriteLdpRsMust
appendNotWritePutToCreate
badStateTokenOnPatchWhenStateTokensSupported
badStateTokenOnPutWhenStateTokensSupported
binaryContentGuaranteeHeaders
binaryContentMediaType
binaryContentOptions
binaryContentProxyWantDigest
binaryContentRedirectStatusGet
binaryContentRedirectStatusHead
binaryContentRedirectWantDigest
conflictIfNotSupportingAclLink
controlAllowedGET
controlAllowedPATCH
controlAllowedPUT
controlDisallowedGET
controlDisallowedPATCH
controlDisallowedPUT
createLDPC
dereferencingGroups
disallowChangeResourceType
disallowPatchContainmentTriples
externalBinaryContentHandlingAttribute
externalBinaryContentHandlingStatus
goodStateTokenOnPatchWhenStateTokensSupported
goodStateTokenOnPutSucceedsWhenStateTokensSupported
httpDeleteStatusCheck
httpDeleteStatusCheckTwo
httpHeadResponseDigest
httpHeadResponseNoBody
httpOptionsSupport
httpOptionsSupportAllow
httpPost
httpPutNR
httpPutUpdateDisallowedTriples
httpPutUpdateDisallowedTriplesConstrainedByHeader
httpPutUpdateDisallowedTriplesResponse
httpPutUpdateTriples
ldpDirectContainerMustAllowHasMemberRelationPredicateToBeSetOnCreate
ldpDirectContainerMustAllowIsMemberOfRelationPredicateToBeSetOnCreate
ldpDirectContainerMustAllowMembershipConstantURIToBeSet
ldpDirectContainerMustAllowMembershipPredicateToBeSetByDefault
ldpDirectContainerMustSetLdpMembershipResourceByDefault
ldpDirectContainerSupportOrConstraintsDocument
ldpIndirectContainerMustAllowHasMemberRelationPredicateToBeSetOnCreate
ldpIndirectContainerMustAllowInsertedContentRelationPredicateToBeSetOnCreate
ldpIndirectContainerMustAllowInsertedContentRelationToBeSetByDefault
ldpIndirectContainerMustAllowIsMemberOfRelationPredicateToBeSetOnCreate
ldpIndirectContainerMustAllowMembershipConstantURIToBeSet
ldpIndirectContainerMustAllowMembershipPredicateToBeSetByDefault
ldpIndirectContainerMustSetLdpMembershipResourceByDefault
ldpIndirectContainerSupportOrConstraintsDocument
ldpcContainmentTriples
ldpcMembershipTriples
ldpcMinimalContainerTriples
ldpcvDoesNotSupportPost
ldpcvMustHaveContainerLinkHeader
ldpcvMustHaveTimeMapLinkHeader
ldpcvMustIncludeAcceptPatchIfPatchAllowed
ldpcvMustIncludeAcceptPostIfPostAllowed
ldpcvMustRespondToGetWithApplicationLinkAcceptHeader
ldpcvMustReturnAcceptPatchHeaderIfPatchIsSupported
ldpcvMustReturnAcceptPostHeaderIfPostIsSupported
ldpcvMustSupportGet
ldpcvMustSupportOptions
ldpcvOptionsMustAllowHeadGetOptions
ldpnrmMustHaveCorrectTimeGate
ldpnrmMustHaveMementoLinkHeader
ldpnrmMustSupportGet
ldpnrvMustSupportPUT
ldpnrvMustSupportPUTForExistingResources
ldprmMustHaveCorrectTimeGate
ldprmMustHaveMementoLinkHeader
ldprmMustNotSupportPatch
ldprmMustNotSupportPost
ldprmMustNotSupportPut
ldprmMustSupportDeleteIfAdvertised
ldprmMustSupportGet
ldprmMustSupportOptions
ldprmOptionsMustSupportGetHeadAndOptions
ldprvMustSupportPUT
ldprvMustSupportPUTForExistingResources
ldpvGetMustReturnHeaderOriginalTypeLink
ldpvGetMustReturnHeaderTimeGateTypeLink
ldpvGetMustReturnOriginalResourceLink
ldpvGetMustReturnTimeGateTypeLink
ldpvGetMustReturnTimeMapLink
ldpvGetMustReturnVaryHeader
linkToAclExisting
linkToAclNonexisting
lpcvMustIncludeAllowHeader
nonRDFSourcePutDigestResponseHeaderAuthentication
onlyAuthorizationStatementsUsed
postDigestResponseHeaderAuthentication
postLdprWithType
postNonRDFSource
postResourceAndCheckAssociatedResource
postToldpcvOfLdpnrWithoutMementoDatetimeMustIgnoreBody
postToldpcvOfLdprsWithoutMementoDatetimeMustIgnoreBody
putNonRDFSourceCreateLDPRS
readAllowedGET
readAllowedHEAD
readDisallowed
rejectRemoteAclConstraint
rejectRemoteAclStatus
rejectRemoteGroupConstraint
rejectRemoteGroupStatus
resourceSingle
respondWantDigestMd5
respondWantDigestNonSupported
respondWantDigestNonSupportedWithSupported
respondWantDigestSha1
respondWantDigestSha256
respondWantDigestTwoSupported
respondWantDigestTwoSupportedQvalueNonZero
respondWantDigestTwoSupportedQvalueZero
responseDescribesHeader
responsePreferenceAppliedHeader
serverManagedPropertiesModification
shouldReturn302WhenLdprmFromTimeGate
statementNotPersistedConstrainedBy
statementNotPersistedResponseBody
successfulPatchStatusCode
supportPatch
testCatchMessage
testEventSerialization
unsupportedBinaryContentHandlingAttribute
unsupportedExternalBinaryContentConstraint
unsupportedExternalBinaryContentStatus
writeAllowedDELETE
writeAllowedPATCH
writeAllowedPOST
writeAllowedPUT
writeDisallowedDelete
writeDisallowedPatch
writeDisallowedPost
writeDisallowedPut
Times for Fedora API Specification Test Suite
Total running time: 17 seconds
Reporter output for Fedora API Specification Test Suite
86 ignored methods
org.fcrepo.spec.testsuite.versioning.LdprvHttpGet
shouldReturn406WhenNoLdprm
org.fcrepo.spec.testsuite.authz.WebACModes
appendNotWriteLdpRsShould
org.fcrepo.spec.testsuite.crud.HttpHead
httpHeadResponseHeadersSameAsHttpGet
org.fcrepo.spec.testsuite.authz.WebACLinkHeaders
aclOnSameServer
org.fcrepo.spec.testsuite.crud.HttpPut
httpPutChangeTypeNotAllowed
putCreateNonRDFSource
putCreateRDFSource
httpPutChangeTypeAllowed
nonRDFSourcePutDigestResponseHeaderVerification
org.fcrepo.spec.testsuite.authz.WebACAccessToClass
accessToClassMayUseInference
org.fcrepo.spec.testsuite.event.NotificationTest
testEventSerializationShould
org.fcrepo.spec.testsuite.versioning.LdpcvHttpPost
ldpcvMayDisallowPatch
ldpcvOfLdprsShouldSupportPostWithoutMementoDatetimeHeader
ldpcvMayDisallowPut
ldpcvOfLdpnrsShouldSupportPostWithoutMementoDatetimeHeader
mementoDatetimeHeaderShouldMatchThatUsedWhenMementoCreated
postToldpcvOfLdprWithMementoDatetimeShouldCreateNewResource
ldpcvMayDisallowPost
org.fcrepo.spec.testsuite.crud.ExternalBinaryContent
binaryContentNoTypeExternalType
postCreateExternalFileUriBinaryRedirect
putCreateExternalFileUriBinaryProxy
postCreateExternalBinaryContentCopy
putCreateExternalBinaryContentRedirect
putCreateExternalBinaryContentCopy
putCreateExternalFileUriBinaryCopy
putCreateExternalBinaryContentProxy
postCreateExternalFileUriBinaryProxy
putCreateExternalFileUriBinaryRedirect
postCreateExternalBinaryContentRedirect
putUpdateExternalBinaryContentRedirect
binaryContentContentTypeAndNoType
binaryContentNoTypeDefault
putUpdateExternalFileUriBinaryCopy
putUpdateExternalFileUriBinaryRedirect
postCreateExternalBinaryContentProxy
binaryContentContentTypeAndType
binaryContentNoTypeUnsupported
putUpdateExternalBinaryContentProxy
putUpdateExternalBinaryContentCopy
putUpdateExternalFileUriBinaryProxy
postCreateExternalFileUriBinaryCopy
org.fcrepo.spec.testsuite.crud.HttpGet
additionalValuesForPreferHeaderContainedDescriptions
additionalValuesForPreferHeader
org.fcrepo.spec.testsuite.versioning.LdpcvHttpDelete
ldpcvThatAdvertisesDeleteShouldRemoveContainerAndMementos
ldpcvMaySupportDelete
org.fcrepo.spec.testsuite.crud.Container
ldpIndirectContainerShouldUseLdpMemberSubjectByDefault
ldpIndirectContainerMayAllowLdpMembershipToBeUpdatedByPatch
ldpIndirectContainerMayAllowLdpIsMemberRelationToBeUpdatedByPatch
ldpIndirectContainerMayAllowLdpInsertedContentRelationPredicateToBeUpdatedByPut
ldpIndirectContainerMayAllowLdpMembershipToBeUpdatedByPut
ldpIndirectContainerMustSetLdpMembershipResourceValueToLDPCByDefault
ldpDirectContainerMayAllowLdpIsMemberRelationPredicateToBeUpdatedByPut
createLDPDirectContainer
ldpDirectContainerMayAllowLdpHasMemberRelationPredicateToBeUpdatedByPut
ldpDirectContainerMayAllowLdpMembershipToBeUpdatedByPatch
ldpIndirectContainerShouldUseLdpMemberByDefault
createLDPIndirectContainer
ldpIndirectContainerMayAllowLdpIsMemberRelationPredicateToBeUpdatedByPut
ldpIndirectContainerMayAllowLdpHasMemberRelationToBeUpdatedByPatch
ldpIndirectContainerMayAllowLdpInsertedContentRelationToBeUpdatedByPatch
ldpDirectContainerMayAllowLdpHasMemberRelationToBeUpdatedByPatch
ldpDirectContainerMustSetLdpMembershipResourceValueToLDPCByDefault
ldpDirectContainerShouldUseLdpMemberByDefault
ldpDirectContainerMayAllowLdpMembershipToBeUpdatedByPut
ldpIndirectContainerMayAllowLdpHasMemberRelationPredicateToBeUpdatedByPut
ldpDirectContainerMayAllowLdpIsMemberRelationToBeUpdatedByPatch
org.fcrepo.spec.testsuite.versioning.LdpcvHttpOptions
ldpcvMaySupportDeleteOption
ldpcvMaySupportPatch
ldpcvMaySupportPost
org.fcrepo.spec.testsuite.crud.HttpPatch
ldpPatchContentTypeSupport
org.fcrepo.spec.testsuite.crud.Ldpnr
ldpnrCreationLinkType
ldpnrCreationWrongLinkType
org.fcrepo.spec.testsuite.authz.WebACLinking
linkToAclOnCreation
org.fcrepo.spec.testsuite.crud.HttpPost
postDigestResponseHeaderVerification
org.fcrepo.spec.testsuite.crud.HttpDelete
httpDeleteOptionsCheck
org.fcrepo.spec.testsuite.versioning.LdprvHttpPut
changeLDPRToAnLDPRv
org.fcrepo.spec.testsuite.versioning.LdprmHttpOptions
ldprmOptionsMaySupportDelete
org.fcrepo.spec.testsuite.crud.StateToken
stateTokenHead
badStateTokenOnPutWhenStateTokensIgnored
stateTokenGet
badStateTokenOnPatchWhenStateTokensIgnored
org.fcrepo.spec.testsuite.authz.WebACCrossDomain
restrictAclToLocal
restrictGroupToLocal
org.fcrepo.spec.testsuite.authz.WebACDefaultACLs
serverSuppliedDefaultAcl
defaultAclOnSameServer
org.fcrepo.spec.testsuite.versioning.ResourceVersioning
convertToLDPRViaPutWithType
Methods in chronological order
org.fcrepo.spec.testsuite.crud.Container
setup 0 ms
createLDPC 9 ms
tearDown 233 ms
setup 234 ms
ldpDirectContainerMustAllowHasMemberRelationPredicateToBeSetOnCreate 234 ms
tearDown 395 ms
setup 395 ms
ldpDirectContainerMustAllowIsMemberOfRelationPredicateToBeSetOnCreate 396 ms
tearDown 396 ms
setup 397 ms
ldpDirectContainerMustAllowMembershipConstantURIToBeSet 397 ms
tearDown 397 ms
setup 398 ms
ldpDirectContainerMustAllowMembershipPredicateToBeSetByDefault 398 ms
tearDown 398 ms
setup 399 ms
ldpDirectContainerMustSetLdpMembershipResourceByDefault 399 ms
tearDown 399 ms
setup 400 ms
ldpDirectContainerSupportOrConstraintsDocument 400 ms
tearDown 562 ms
setup 562 ms
ldpIndirectContainerMustAllowHasMemberRelationPredicateToBeSetOnCreate 562 ms
tearDown 661 ms
setup 662 ms
ldpIndirectContainerMustAllowInsertedContentRelationPredicateToBeSetOnCreate 662 ms
tearDown 662 ms
setup 662 ms
ldpIndirectContainerMustAllowInsertedContentRelationToBeSetByDefault 662 ms
tearDown 663 ms
setup 663 ms
ldpIndirectContainerMustAllowIsMemberOfRelationPredicateToBeSetOnCreate 663 ms
tearDown 663 ms
setup 663 ms
ldpIndirectContainerMustAllowMembershipConstantURIToBeSet 664 ms
tearDown 664 ms
setup 664 ms
ldpIndirectContainerMustAllowMembershipPredicateToBeSetByDefault 664 ms
tearDown 665 ms
setup 665 ms
ldpIndirectContainerMustSetLdpMembershipResourceByDefault 666 ms
tearDown 667 ms
setup 667 ms
ldpIndirectContainerSupportOrConstraintsDocument 668 ms
tearDown 715 ms
setup 715 ms
ldpcContainmentTriples 716 ms
tearDown 1100 ms
setup 1101 ms
ldpcMembershipTriples 1101 ms
tearDown 1102 ms
setup 1102 ms
ldpcMinimalContainerTriples 1102 ms
tearDown 1401 ms
org.fcrepo.spec.testsuite.crud.HttpGet
setup 1402 ms
respondWantDigestMd5 1402 ms
tearDown 1545 ms
setup 1545 ms
respondWantDigestNonSupported 1546 ms
tearDown 1650 ms
setup 1651 ms
respondWantDigestNonSupportedWithSupported 1651 ms
tearDown 1743 ms
setup 1744 ms
respondWantDigestSha1 1744 ms
tearDown 1843 ms
setup 1844 ms
respondWantDigestSha256 1845 ms
tearDown 1945 ms
setup 1945 ms
respondWantDigestTwoSupported 1946 ms
tearDown 2056 ms
setup 2057 ms
respondWantDigestTwoSupportedQvalueNonZero 2057 ms
tearDown 2147 ms
setup 2147 ms
respondWantDigestTwoSupportedQvalueZero 2147 ms
tearDown 2239 ms
setup 2239 ms
responseDescribesHeader 2239 ms
tearDown 2360 ms
setup 2360 ms
responsePreferenceAppliedHeader 2360 ms
tearDown 2447 ms
org.fcrepo.spec.testsuite.versioning.LdpcvHttpOptions
setup 2448 ms
ldpcvMustReturnAcceptPatchHeaderIfPatchIsSupported 2448 ms
tearDown 2594 ms
setup 2595 ms
ldpcvMustReturnAcceptPostHeaderIfPostIsSupported 2595 ms
tearDown 2723 ms
setup 2724 ms
ldpcvMustSupportOptions 2724 ms
tearDown 2856 ms
setup 2857 ms
ldpcvOptionsMustAllowHeadGetOptions 2857 ms
tearDown 3015 ms
org.fcrepo.spec.testsuite.crud.HttpHead
setup 3018 ms
httpHeadResponseDigest 3018 ms
tearDown 3099 ms
setup 3100 ms
httpHeadResponseNoBody 3100 ms
tearDown 3168 ms
org.fcrepo.spec.testsuite.versioning.ResourceVersioning
setup 3168 ms
postLdprWithType 3168 ms
tearDown 3206 ms
org.fcrepo.spec.testsuite.crud.HttpOptions
setup 3207 ms
httpOptionsSupport 3208 ms
tearDown 3224 ms
setup 3225 ms
httpOptionsSupportAllow 3225 ms
tearDown 3242 ms
org.fcrepo.spec.testsuite.authz.WebACLinking
setup 3242 ms
conflictIfNotSupportingAclLink 3243 ms
tearDown 3319 ms
org.fcrepo.spec.testsuite.crud.HttpPost
setup 3320 ms
httpPost 3321 ms
tearDown 3385 ms
setup 3386 ms
postDigestResponseHeaderAuthentication 3386 ms
tearDown 3436 ms
setup 3436 ms
postNonRDFSource 3436 ms
tearDown 3468 ms
setup 3468 ms
postResourceAndCheckAssociatedResource 3468 ms
tearDown 3548 ms
org.fcrepo.spec.testsuite.authz.WebACModes
setup 3549 ms
appendAllowedPATCH 3549 ms
tearDown 3720 ms
setup 3720 ms
appendAllowedPOST 3720 ms
tearDown 3928 ms
setup 3928 ms
appendDisallowed 3928 ms
tearDown 4084 ms
setup 4085 ms
appendNotWriteLdpCMust 4085 ms
tearDown 4204 ms
setup 4204 ms
appendNotWriteLdpNr 4205 ms
tearDown 4419 ms
setup 4419 ms
appendNotWriteLdpRsMust 4420 ms
tearDown 4573 ms
setup 4573 ms
appendNotWritePutToCreate 4573 ms
tearDown 4688 ms
setup 4689 ms
controlAllowedGET 4689 ms
tearDown 4840 ms
setup 4840 ms
controlAllowedPATCH 4840 ms
tearDown 4973 ms
setup 4974 ms
controlAllowedPUT 4974 ms
tearDown 5119 ms
setup 5120 ms
controlDisallowedGET 5120 ms
tearDown 5245 ms
setup 5245 ms
controlDisallowedPATCH 5246 ms
tearDown 5390 ms
setup 5390 ms
controlDisallowedPUT 5390 ms
tearDown 5544 ms
setup 5544 ms
readAllowedGET 5545 ms
tearDown 5681 ms
setup 5682 ms
readAllowedHEAD 5682 ms
tearDown 5803 ms
setup 5804 ms
readDisallowed 5804 ms
tearDown 5971 ms
setup 5972 ms
writeAllowedDELETE 5972 ms
tearDown 6116 ms
setup 6116 ms
writeAllowedPATCH 6117 ms
tearDown 6207 ms
setup 6207 ms
writeAllowedPOST 6207 ms
tearDown 6334 ms
setup 6334 ms
writeAllowedPUT 6335 ms
tearDown 6421 ms
setup 6422 ms
writeDisallowedDelete 6422 ms
tearDown 6504 ms
setup 6504 ms
writeDisallowedPatch 6505 ms
tearDown 6578 ms
setup 6579 ms
writeDisallowedPost 6579 ms
tearDown 6649 ms
setup 6650 ms
writeDisallowedPut 6650 ms
tearDown 6743 ms
org.fcrepo.spec.testsuite.crud.HttpPut
setup 6744 ms
httpPutNR 6745 ms
tearDown 6806 ms
setup 6806 ms
httpPutUpdateDisallowedTriples 6806 ms
tearDown 6940 ms
setup 6940 ms
httpPutUpdateDisallowedTriplesConstrainedByHeader 6941 ms
tearDown 7047 ms
setup 7047 ms
httpPutUpdateDisallowedTriplesResponse 7047 ms
tearDown 7171 ms
setup 7171 ms
httpPutUpdateTriples 7171 ms
tearDown 7264 ms
setup 7265 ms
nonRDFSourcePutDigestResponseHeaderAuthentication 7265 ms
tearDown 7328 ms
setup 7329 ms
putNonRDFSourceCreateLDPRS 7329 ms
tearDown 7368 ms
org.fcrepo.spec.testsuite.authz.WebACLinkHeaders
setup 7369 ms
linkToAclExisting 7370 ms
tearDown 7554 ms
setup 7554 ms
linkToAclNonexisting 7555 ms
tearDown 7642 ms
org.fcrepo.spec.testsuite.crud.HttpPatch
setup 7644 ms
disallowChangeResourceType 7644 ms
tearDown 7907 ms
setup 7907 ms
disallowPatchContainmentTriples 7907 ms
tearDown 8014 ms
setup 8014 ms
serverManagedPropertiesModification 8014 ms
tearDown 8059 ms
setup 8060 ms
statementNotPersistedConstrainedBy 8060 ms
tearDown 8861 ms
setup 8861 ms
statementNotPersistedResponseBody 8861 ms
tearDown 8943 ms
setup 8943 ms
successfulPatchStatusCode 8944 ms
tearDown 9016 ms
setup 9016 ms
supportPatch 9016 ms
tearDown 9067 ms
org.fcrepo.spec.testsuite.authz.WebACRepresentation
setup 9067 ms
accessDenied 9068 ms
tearDown 9170 ms
setup 9170 ms
aclExamined 9170 ms
tearDown 9255 ms
setup 9255 ms
aclRepresentation 9255 ms
tearDown 9338 ms
setup 9338 ms
dereferencingGroups 9338 ms
tearDown 9531 ms
setup 9532 ms
onlyAuthorizationStatementsUsed 9532 ms
tearDown 9659 ms
org.fcrepo.spec.testsuite.crud.HttpDelete
setup 9661 ms
httpDeleteStatusCheck 9661 ms
tearDown 9942 ms
setup 9943 ms
httpDeleteStatusCheckTwo 9943 ms
tearDown 10343 ms
org.fcrepo.spec.testsuite.authz.WebACRdfSources
setup 10343 ms
aclIsLDPRS 10344 ms
tearDown 10461 ms
org.fcrepo.spec.testsuite.crud.ExternalBinaryContent
setup 10462 ms
binaryContentGuaranteeHeaders 10462 ms
tearDown 10474 ms
setup 10474 ms
binaryContentMediaType 10474 ms
tearDown 10474 ms
setup 10474 ms
binaryContentOptions 10474 ms
tearDown 10475 ms
setup 10475 ms
binaryContentProxyWantDigest 10475 ms
tearDown 10475 ms
setup 10475 ms
binaryContentRedirectStatusGet 10475 ms
tearDown 10475 ms
setup 10476 ms
binaryContentRedirectStatusHead 10476 ms
tearDown 10476 ms
setup 10476 ms
binaryContentRedirectWantDigest 10476 ms
tearDown 10476 ms
setup 10477 ms
externalBinaryContentHandlingAttribute 10477 ms
tearDown 10477 ms
setup 10477 ms
externalBinaryContentHandlingStatus 10477 ms
tearDown 10477 ms
setup 10477 ms
unsupportedBinaryContentHandlingAttribute 10478 ms
tearDown 10478 ms
setup 10478 ms
unsupportedExternalBinaryContentConstraint 10478 ms
tearDown 10513 ms
setup 10514 ms
unsupportedExternalBinaryContentStatus 10514 ms
tearDown 10547 ms
stopServer 10548 ms
org.fcrepo.spec.testsuite.authz.WebACGeneral
setup 10551 ms
agentAll 10551 ms
tearDown 10671 ms
setup 10672 ms
agentDouble 10672 ms
tearDown 10834 ms
setup 10835 ms
agentGroup 10835 ms
tearDown 11041 ms
setup 11041 ms
agentGroupWithHashUris 11041 ms
tearDown 11192 ms
setup 11193 ms
agentSingle 11193 ms
tearDown 11285 ms
setup 11285 ms
allAuthenticatedAgents 11285 ms
tearDown 11394 ms
setup 11394 ms
resourceSingle 11394 ms
tearDown 11562 ms
org.fcrepo.spec.testsuite.crud.StateToken
setup 11564 ms
badStateTokenOnPatchWhenStateTokensSupported 11564 ms
tearDown 11625 ms
setup 11626 ms
badStateTokenOnPutWhenStateTokensSupported 11626 ms
tearDown 11661 ms
setup 11661 ms
goodStateTokenOnPatchWhenStateTokensSupported 11661 ms
tearDown 11695 ms
setup 11695 ms
goodStateTokenOnPutSucceedsWhenStateTokensSupported 11695 ms
tearDown 11766 ms
org.fcrepo.spec.testsuite.authz.WebACDefaultACLs
setup 11767 ms
aclInheritanceMustUseLdpContainmentRelationships 11767 ms
tearDown 11994 ms
org.fcrepo.spec.testsuite.versioning.LdprvHttpGet
setup 11995 ms
ldpvGetMustReturnHeaderOriginalTypeLink 11995 ms
tearDown 12052 ms
setup 12052 ms
ldpvGetMustReturnHeaderTimeGateTypeLink 12052 ms
tearDown 12111 ms
setup 12111 ms
ldpvGetMustReturnOriginalResourceLink 12111 ms
tearDown 12153 ms
setup 12154 ms
ldpvGetMustReturnTimeGateTypeLink 12155 ms
tearDown 12209 ms
setup 12209 ms
ldpvGetMustReturnTimeMapLink 12209 ms
tearDown 12266 ms
setup 12266 ms
ldpvGetMustReturnVaryHeader 12266 ms
tearDown 12325 ms
setup 12325 ms
shouldReturn302WhenLdprmFromTimeGate 12325 ms
tearDown 12516 ms
org.fcrepo.spec.testsuite.authz.WebACAccessToClass
setup 12516 ms
accessToClassMustGiveAccessToBinary 12516 ms
tearDown 12657 ms
setup 12657 ms
accessToClassMustGiveAccessToContainer 12658 ms
tearDown 12819 ms
org.fcrepo.spec.testsuite.versioning.LdprvHttpPut
setup 12819 ms
ldpnrvMustSupportPUT 12819 ms
tearDown 12839 ms
setup 12840 ms
ldpnrvMustSupportPUTForExistingResources 12840 ms
tearDown 12862 ms
setup 12862 ms
ldprvMustSupportPUT 12862 ms
tearDown 12882 ms
setup 12882 ms
ldprvMustSupportPUTForExistingResources 12882 ms
tearDown 12902 ms
org.fcrepo.spec.testsuite.authz.WebACCrossDomain
setup 12902 ms
rejectRemoteAclConstraint 12902 ms
tearDown 12932 ms
setup 12932 ms
rejectRemoteAclStatus 12932 ms
tearDown 12940 ms
setup 12940 ms
rejectRemoteGroupConstraint 12940 ms
tearDown 13002 ms
setup 13002 ms
rejectRemoteGroupStatus 13003 ms
tearDown 13065 ms
org.fcrepo.spec.testsuite.versioning.LdprmHttpGet
setup 13065 ms
ldpnrmMustHaveCorrectTimeGate 13065 ms
tearDown 13164 ms
setup 13164 ms
ldpnrmMustHaveMementoLinkHeader 13164 ms
tearDown 13294 ms
setup 13294 ms
ldpnrmMustSupportGet 13294 ms
tearDown 13398 ms
setup 13398 ms
ldprmMustHaveCorrectTimeGate 13399 ms
tearDown 13537 ms
setup 13538 ms
ldprmMustHaveMementoLinkHeader 13538 ms
tearDown 13668 ms
setup 13669 ms
ldprmMustSupportGet 13669 ms
tearDown 13810 ms
org.fcrepo.spec.testsuite.event.NotificationTest
beforeClass 13811 ms
setup 14054 ms
testCatchMessage 14055 ms
tearDown 14757 ms
setup 14757 ms
testEventSerialization 14758 ms
tearDown 16243 ms
closeConnection 16243 ms
org.fcrepo.spec.testsuite.versioning.LdprmHttpDelete
setup 16243 ms
ldprmMustSupportDeleteIfAdvertised 16244 ms
tearDown 16329 ms
org.fcrepo.spec.testsuite.versioning.LdprmHttpOptions
setup 16329 ms
ldprmMustNotSupportPatch 16329 ms
tearDown 16451 ms
setup 16451 ms
ldprmMustNotSupportPost 16451 ms
tearDown 16590 ms
setup 16590 ms
ldprmMustNotSupportPut 16590 ms
tearDown 16720 ms
setup 16720 ms
ldprmMustSupportOptions 16720 ms
tearDown 16852 ms
setup 16852 ms
ldprmOptionsMustSupportGetHeadAndOptions 16852 ms
tearDown 16996 ms
org.fcrepo.spec.testsuite.versioning.LdpcvHttpGet
setup 16997 ms
ldpcvMustHaveContainerLinkHeader 16997 ms
tearDown 17096 ms
setup 17097 ms
ldpcvMustHaveTimeMapLinkHeader 17097 ms
tearDown 17209 ms
setup 17209 ms
ldpcvMustIncludeAcceptPatchIfPatchAllowed 17209 ms
tearDown 17322 ms
setup 17323 ms
ldpcvMustIncludeAcceptPostIfPostAllowed 17323 ms
tearDown 17436 ms
setup 17437 ms
ldpcvMustRespondToGetWithApplicationLinkAcceptHeader 17437 ms
tearDown 17485 ms
setup 17486 ms
ldpcvMustSupportGet 17486 ms
tearDown 17546 ms
setup 17546 ms
lpcvMustIncludeAllowHeader 17546 ms
tearDown 17602 ms
org.fcrepo.spec.testsuite.versioning.LdpcvHttpPost
setup 17603 ms
ldpcvDoesNotSupportPost 17603 ms
tearDown 17670 ms
setup 17670 ms
postToldpcvOfLdpnrWithoutMementoDatetimeMustIgnoreBody 17671 ms
tearDown 17722 ms
setup 17722 ms
postToldpcvOfLdprsWithoutMementoDatetimeMustIgnoreBody 17723 ms
tearDown 17792 ms