Test results
1 suite, 45 failed tests
org.fcrepo.spec.testsuite.versioning.LdprvHttpPut
ldpnrvMustSupportPUT
java.lang.IllegalArgumentException: path cannot be null at org.codehaus.groovy.runtime.callsite.ConstructorSite$ConstructorSiteNoUnwrap.callConstructor(ConstructorSite.java:84) at org.codehaus.groovy.runtime.callsite.CallSiteArray.defaultCallConstructor(CallSiteArray.java:60) at org.codehaus.groovy.runtime.callsite.AbstractCallSite.callConstructor(AbstractCallSite.java:235) at org.codehaus.groovy.runtime.callsite.AbstractCallSite.callConstructor(AbstractCallSite.java:247) at io.restassured.internal.assertion.AssertParameter.notNull(AssertParameter.groovy:26) at io.restassured.internal.assertion.AssertParameter$notNull.callStatic(Unknown Source) at org.codehaus.groovy.runtime.callsite.CallSiteArray.defaultCallStatic(CallSiteArray.java:56) at io.restassured.internal.assertion.AssertParameter$notNull.callStatic(Unknown Source) at io.restassured.internal.RequestSpecificationImpl.applyPathParamsAndSendRequest(RequestSpecificationImpl.groovy:1680) at groovy.lang.MetaMethod.doMethodInvoke(MetaMethod.java:325) at groovy.lang.MetaClassImpl.invokeMethod(MetaClassImpl.java:1213) at groovy.lang.MetaClassImpl.invokeMethod(MetaClassImpl.java:1022) at groovy.lang.MetaClassImpl.invokeMethod(MetaClassImpl.java:810) at io.restassured.internal.RequestSpecificationImpl.invokeMethod(RequestSpecificationImpl.groovy) at org.codehaus.groovy.runtime.callsite.PogoInterceptableSite.call(PogoInterceptableSite.java:48) at org.codehaus.groovy.runtime.callsite.PogoInterceptableSite.callCurrent(PogoInterceptableSite.java:58) at org.codehaus.groovy.runtime.callsite.AbstractCallSite.callCurrent(AbstractCallSite.java:182) at io.restassured.internal.RequestSpecificationImpl.applyPathParamsAndSendRequest(RequestSpecificationImpl.groovy:1738) at groovy.lang.MetaMethod.doMethodInvoke(MetaMethod.java:325) at groovy.lang.MetaClassImpl.invokeMethod(MetaClassImpl.java:1213) at groovy.lang.MetaClassImpl.invokeMethod(MetaClassImpl.java:1022) at groovy.lang.MetaClassImpl.invokeMethod(MetaClassImpl.java:810) at io.restassured.internal.RequestSpecificationImpl.invokeMethod(RequestSpecificationImpl.groovy) at org.codehaus.groovy.runtime.callsite.PogoInterceptableSite.call(PogoInterceptableSite.java:48) at org.codehaus.groovy.runtime.callsite.PogoInterceptableSite.callCurrent(PogoInterceptableSite.java:58) at org.codehaus.groovy.runtime.callsite.AbstractCallSite.callCurrent(AbstractCallSite.java:182) at io.restassured.internal.RequestSpecificationImpl.get(RequestSpecificationImpl.groovy:170) at io.restassured.internal.RequestSpecificationImpl.get(RequestSpecificationImpl.groovy) at org.fcrepo.spec.testsuite.AbstractTest.doGetUnverified(AbstractTest.java:408) at org.fcrepo.spec.testsuite.AbstractTest.doGet(AbstractTest.java:388) at org.fcrepo.spec.testsuite.AbstractTest.doGet(AbstractTest.java:396) at org.fcrepo.spec.testsuite.versioning.LdprvHttpPut.ldpnrvMustSupportPUT(LdprvHttpPut.java:140) at org.fcrepo.spec.testsuite.App.main(App.java:309) ... Removed 36 stack frames
ldpnrvMustSupportPUTForExistingResources
java.lang.IllegalArgumentException: path cannot be null at org.codehaus.groovy.runtime.callsite.ConstructorSite$ConstructorSiteNoUnwrap.callConstructor(ConstructorSite.java:84) at org.codehaus.groovy.runtime.callsite.AbstractCallSite.callConstructor(AbstractCallSite.java:247) at io.restassured.internal.assertion.AssertParameter.notNull(AssertParameter.groovy:26) at io.restassured.internal.assertion.AssertParameter$notNull.callStatic(Unknown Source) at org.codehaus.groovy.runtime.callsite.CallSiteArray.defaultCallStatic(CallSiteArray.java:56) at io.restassured.internal.assertion.AssertParameter$notNull.callStatic(Unknown Source) at io.restassured.internal.RequestSpecificationImpl.applyPathParamsAndSendRequest(RequestSpecificationImpl.groovy:1680) at groovy.lang.MetaMethod.doMethodInvoke(MetaMethod.java:325) at groovy.lang.MetaClassImpl.invokeMethod(MetaClassImpl.java:1213) at groovy.lang.MetaClassImpl.invokeMethod(MetaClassImpl.java:1022) at groovy.lang.MetaClassImpl.invokeMethod(MetaClassImpl.java:810) at io.restassured.internal.RequestSpecificationImpl.invokeMethod(RequestSpecificationImpl.groovy) at org.codehaus.groovy.runtime.callsite.PogoInterceptableSite.call(PogoInterceptableSite.java:48) at org.codehaus.groovy.runtime.callsite.PogoInterceptableSite.callCurrent(PogoInterceptableSite.java:58) at org.codehaus.groovy.runtime.callsite.AbstractCallSite.callCurrent(AbstractCallSite.java:182) at io.restassured.internal.RequestSpecificationImpl.applyPathParamsAndSendRequest(RequestSpecificationImpl.groovy:1738) at groovy.lang.MetaMethod.doMethodInvoke(MetaMethod.java:325) at groovy.lang.MetaClassImpl.invokeMethod(MetaClassImpl.java:1213) at groovy.lang.MetaClassImpl.invokeMethod(MetaClassImpl.java:1022) at groovy.lang.MetaClassImpl.invokeMethod(MetaClassImpl.java:810) at io.restassured.internal.RequestSpecificationImpl.invokeMethod(RequestSpecificationImpl.groovy) at org.codehaus.groovy.runtime.callsite.PogoInterceptableSite.call(PogoInterceptableSite.java:48) at org.codehaus.groovy.runtime.callsite.PogoInterceptableSite.callCurrent(PogoInterceptableSite.java:58) at org.codehaus.groovy.runtime.callsite.AbstractCallSite.callCurrent(AbstractCallSite.java:182) at io.restassured.internal.RequestSpecificationImpl.get(RequestSpecificationImpl.groovy:170) at io.restassured.internal.RequestSpecificationImpl.get(RequestSpecificationImpl.groovy) at org.fcrepo.spec.testsuite.AbstractTest.doGetUnverified(AbstractTest.java:408) at org.fcrepo.spec.testsuite.AbstractTest.doGet(AbstractTest.java:388) at org.fcrepo.spec.testsuite.AbstractTest.doGet(AbstractTest.java:396) at org.fcrepo.spec.testsuite.versioning.LdprvHttpPut.ldpnrvMustSupportPUTForExistingResources(LdprvHttpPut.java:160) at org.fcrepo.spec.testsuite.App.main(App.java:309) ... Removed 36 stack frames
ldprvMustSupportPUT
java.lang.IllegalArgumentException: path cannot be null at org.codehaus.groovy.runtime.callsite.ConstructorSite$ConstructorSiteNoUnwrap.callConstructor(ConstructorSite.java:84) at org.codehaus.groovy.runtime.callsite.AbstractCallSite.callConstructor(AbstractCallSite.java:247) at io.restassured.internal.assertion.AssertParameter.notNull(AssertParameter.groovy:26) at io.restassured.internal.assertion.AssertParameter$notNull.callStatic(Unknown Source) at org.codehaus.groovy.runtime.callsite.CallSiteArray.defaultCallStatic(CallSiteArray.java:56) at io.restassured.internal.assertion.AssertParameter$notNull.callStatic(Unknown Source) at io.restassured.internal.RequestSpecificationImpl.applyPathParamsAndSendRequest(RequestSpecificationImpl.groovy:1680) at groovy.lang.MetaMethod.doMethodInvoke(MetaMethod.java:325) at groovy.lang.MetaClassImpl.invokeMethod(MetaClassImpl.java:1213) at groovy.lang.MetaClassImpl.invokeMethod(MetaClassImpl.java:1022) at groovy.lang.MetaClassImpl.invokeMethod(MetaClassImpl.java:810) at io.restassured.internal.RequestSpecificationImpl.invokeMethod(RequestSpecificationImpl.groovy) at org.codehaus.groovy.runtime.callsite.PogoInterceptableSite.call(PogoInterceptableSite.java:48) at org.codehaus.groovy.runtime.callsite.PogoInterceptableSite.callCurrent(PogoInterceptableSite.java:58) at org.codehaus.groovy.runtime.callsite.AbstractCallSite.callCurrent(AbstractCallSite.java:182) at io.restassured.internal.RequestSpecificationImpl.applyPathParamsAndSendRequest(RequestSpecificationImpl.groovy:1738) at groovy.lang.MetaMethod.doMethodInvoke(MetaMethod.java:325) at groovy.lang.MetaClassImpl.invokeMethod(MetaClassImpl.java:1213) at groovy.lang.MetaClassImpl.invokeMethod(MetaClassImpl.java:1022) at groovy.lang.MetaClassImpl.invokeMethod(MetaClassImpl.java:810) at io.restassured.internal.RequestSpecificationImpl.invokeMethod(RequestSpecificationImpl.groovy) at org.codehaus.groovy.runtime.callsite.PogoInterceptableSite.call(PogoInterceptableSite.java:48) at org.codehaus.groovy.runtime.callsite.PogoInterceptableSite.callCurrent(PogoInterceptableSite.java:58) at org.codehaus.groovy.runtime.callsite.AbstractCallSite.callCurrent(AbstractCallSite.java:182) at io.restassured.internal.RequestSpecificationImpl.get(RequestSpecificationImpl.groovy:170) at io.restassured.internal.RequestSpecificationImpl.get(RequestSpecificationImpl.groovy) at org.fcrepo.spec.testsuite.AbstractTest.doGetUnverified(AbstractTest.java:408) at org.fcrepo.spec.testsuite.AbstractTest.doGet(AbstractTest.java:388) at org.fcrepo.spec.testsuite.AbstractTest.doGet(AbstractTest.java:396) at org.fcrepo.spec.testsuite.versioning.LdprvHttpPut.ldprvMustSupportPUT(LdprvHttpPut.java:83) at org.fcrepo.spec.testsuite.App.main(App.java:309) ... Removed 36 stack frames
ldprvMustSupportPUTForExistingResources
java.lang.IllegalArgumentException: path cannot be null at org.codehaus.groovy.runtime.callsite.ConstructorSite$ConstructorSiteNoUnwrap.callConstructor(ConstructorSite.java:84) at org.codehaus.groovy.runtime.callsite.AbstractCallSite.callConstructor(AbstractCallSite.java:247) at io.restassured.internal.assertion.AssertParameter.notNull(AssertParameter.groovy:26) at io.restassured.internal.assertion.AssertParameter$notNull.callStatic(Unknown Source) at org.codehaus.groovy.runtime.callsite.CallSiteArray.defaultCallStatic(CallSiteArray.java:56) at io.restassured.internal.assertion.AssertParameter$notNull.callStatic(Unknown Source) at io.restassured.internal.RequestSpecificationImpl.applyPathParamsAndSendRequest(RequestSpecificationImpl.groovy:1680) at groovy.lang.MetaMethod.doMethodInvoke(MetaMethod.java:325) at groovy.lang.MetaClassImpl.invokeMethod(MetaClassImpl.java:1213) at groovy.lang.MetaClassImpl.invokeMethod(MetaClassImpl.java:1022) at groovy.lang.MetaClassImpl.invokeMethod(MetaClassImpl.java:810) at io.restassured.internal.RequestSpecificationImpl.invokeMethod(RequestSpecificationImpl.groovy) at org.codehaus.groovy.runtime.callsite.PogoInterceptableSite.call(PogoInterceptableSite.java:48) at org.codehaus.groovy.runtime.callsite.PogoInterceptableSite.callCurrent(PogoInterceptableSite.java:58) at org.codehaus.groovy.runtime.callsite.AbstractCallSite.callCurrent(AbstractCallSite.java:182) at io.restassured.internal.RequestSpecificationImpl.applyPathParamsAndSendRequest(RequestSpecificationImpl.groovy:1738) at groovy.lang.MetaMethod.doMethodInvoke(MetaMethod.java:325) at groovy.lang.MetaClassImpl.invokeMethod(MetaClassImpl.java:1213) at groovy.lang.MetaClassImpl.invokeMethod(MetaClassImpl.java:1022) at groovy.lang.MetaClassImpl.invokeMethod(MetaClassImpl.java:810) at io.restassured.internal.RequestSpecificationImpl.invokeMethod(RequestSpecificationImpl.groovy) at org.codehaus.groovy.runtime.callsite.PogoInterceptableSite.call(PogoInterceptableSite.java:48) at org.codehaus.groovy.runtime.callsite.PogoInterceptableSite.callCurrent(PogoInterceptableSite.java:58) at org.codehaus.groovy.runtime.callsite.AbstractCallSite.callCurrent(AbstractCallSite.java:182) at io.restassured.internal.RequestSpecificationImpl.get(RequestSpecificationImpl.groovy:170) at io.restassured.internal.RequestSpecificationImpl.get(RequestSpecificationImpl.groovy) at org.fcrepo.spec.testsuite.AbstractTest.doGetUnverified(AbstractTest.java:400) at org.fcrepo.spec.testsuite.AbstractTest.doGet(AbstractTest.java:380) at org.fcrepo.spec.testsuite.versioning.LdprvHttpPut.ldprvMustSupportPUTForExistingResources(LdprvHttpPut.java:104) at org.fcrepo.spec.testsuite.App.main(App.java:309) ... Removed 36 stack frames
org.fcrepo.spec.testsuite.crud.Container
ldpDirectContainerMustAllowMembershipPredicateToBeSetByDefault
java.lang.AssertionError: 1 expectation failed. Expected status code <201> but was <409>. at org.codehaus.groovy.runtime.callsite.ConstructorSite$ConstructorSiteNoUnwrap.callConstructor(ConstructorSite.java:84) at org.codehaus.groovy.runtime.callsite.CallSiteArray.defaultCallConstructor(CallSiteArray.java:60) at org.codehaus.groovy.runtime.callsite.AbstractCallSite.callConstructor(AbstractCallSite.java:235) at org.codehaus.groovy.runtime.callsite.AbstractCallSite.callConstructor(AbstractCallSite.java:247) at io.restassured.internal.ResponseSpecificationImpl$HamcrestAssertionClosure.validate(ResponseSpecificationImpl.groovy:483) at io.restassured.internal.ResponseSpecificationImpl$HamcrestAssertionClosure$validate$1.call(Unknown Source) at io.restassured.internal.ResponseSpecificationImpl.validateResponseIfRequired(ResponseSpecificationImpl.groovy:655) at org.codehaus.groovy.runtime.callsite.PogoMetaMethodSite$PogoCachedMethodSiteNoUnwrapNoCoerce.invoke(PogoMetaMethodSite.java:210) at org.codehaus.groovy.runtime.callsite.PogoMetaMethodSite.callCurrent(PogoMetaMethodSite.java:59) at org.codehaus.groovy.runtime.callsite.AbstractCallSite.callCurrent(AbstractCallSite.java:166) at io.restassured.internal.ResponseSpecificationImpl.statusCode(ResponseSpecificationImpl.groovy:123) at io.restassured.specification.ResponseSpecification$statusCode$0.callCurrent(Unknown Source) at io.restassured.internal.ResponseSpecificationImpl.statusCode(ResponseSpecificationImpl.groovy:131) at io.restassured.internal.ValidatableResponseOptionsImpl.statusCode(ValidatableResponseOptionsImpl.java:119) at org.fcrepo.spec.testsuite.AbstractTest.createDirectContainer(AbstractTest.java:198) at org.fcrepo.spec.testsuite.crud.Container.ldpDirectContainerMustAllowMembershipPredicateToBeSetByDefault(Container.java:591) at org.fcrepo.spec.testsuite.App.main(App.java:309) ... Removed 32 stack frames
ldpDirectContainerMustSetLdpMembershipResourceByDefault
java.lang.AssertionError: 1 expectation failed. Expected status code <201> but was <409>. at org.codehaus.groovy.runtime.callsite.ConstructorSite$ConstructorSiteNoUnwrap.callConstructor(ConstructorSite.java:84) at org.codehaus.groovy.runtime.callsite.AbstractCallSite.callConstructor(AbstractCallSite.java:247) at io.restassured.internal.ResponseSpecificationImpl$HamcrestAssertionClosure.validate(ResponseSpecificationImpl.groovy:483) at io.restassured.internal.ResponseSpecificationImpl$HamcrestAssertionClosure$validate$1.call(Unknown Source) at io.restassured.internal.ResponseSpecificationImpl.validateResponseIfRequired(ResponseSpecificationImpl.groovy:655) at org.codehaus.groovy.runtime.callsite.PogoMetaMethodSite$PogoCachedMethodSiteNoUnwrapNoCoerce.invoke(PogoMetaMethodSite.java:210) at org.codehaus.groovy.runtime.callsite.PogoMetaMethodSite.callCurrent(PogoMetaMethodSite.java:59) at org.codehaus.groovy.runtime.callsite.AbstractCallSite.callCurrent(AbstractCallSite.java:166) at io.restassured.internal.ResponseSpecificationImpl.statusCode(ResponseSpecificationImpl.groovy:123) at io.restassured.specification.ResponseSpecification$statusCode$0.callCurrent(Unknown Source) at io.restassured.internal.ResponseSpecificationImpl.statusCode(ResponseSpecificationImpl.groovy:131) at io.restassured.internal.ValidatableResponseOptionsImpl.statusCode(ValidatableResponseOptionsImpl.java:119) at org.fcrepo.spec.testsuite.AbstractTest.createDirectContainer(AbstractTest.java:198) at org.fcrepo.spec.testsuite.crud.Container.ldpDirectContainerMustSetLdpMembershipResourceByDefault(Container.java:404) at org.fcrepo.spec.testsuite.App.main(App.java:309) ... Removed 32 stack frames
ldpIndirectContainerMustAllowInsertedContentRelationToBeSetByDefault
java.lang.AssertionError: 1 expectation failed. Expected status code <201> but was <409>. at org.codehaus.groovy.runtime.callsite.ConstructorSite$ConstructorSiteNoUnwrap.callConstructor(ConstructorSite.java:84) at org.codehaus.groovy.runtime.callsite.AbstractCallSite.callConstructor(AbstractCallSite.java:247) at io.restassured.internal.ResponseSpecificationImpl$HamcrestAssertionClosure.validate(ResponseSpecificationImpl.groovy:483) at io.restassured.internal.ResponseSpecificationImpl$HamcrestAssertionClosure$validate$1.call(Unknown Source) at io.restassured.internal.ResponseSpecificationImpl.validateResponseIfRequired(ResponseSpecificationImpl.groovy:655) at org.codehaus.groovy.runtime.callsite.PogoMetaMethodSite$PogoCachedMethodSiteNoUnwrapNoCoerce.invoke(PogoMetaMethodSite.java:210) at org.codehaus.groovy.runtime.callsite.PogoMetaMethodSite.callCurrent(PogoMetaMethodSite.java:59) at org.codehaus.groovy.runtime.callsite.AbstractCallSite.callCurrent(AbstractCallSite.java:166) at io.restassured.internal.ResponseSpecificationImpl.statusCode(ResponseSpecificationImpl.groovy:123) at io.restassured.specification.ResponseSpecification$statusCode$0.callCurrent(Unknown Source) at io.restassured.internal.ResponseSpecificationImpl.statusCode(ResponseSpecificationImpl.groovy:131) at io.restassured.internal.ValidatableResponseOptionsImpl.statusCode(ValidatableResponseOptionsImpl.java:119) at org.fcrepo.spec.testsuite.AbstractTest.createIndirectContainer(AbstractTest.java:207) at org.fcrepo.spec.testsuite.crud.Container.ldpIndirectContainerMustAllowInsertedContentRelationToBeSetByDefault(Container.java:1267) at org.fcrepo.spec.testsuite.App.main(App.java:309) ... Removed 31 stack frames
ldpIndirectContainerMustAllowMembershipPredicateToBeSetByDefault
java.lang.AssertionError: 1 expectation failed. Expected status code <201> but was <409>. at org.codehaus.groovy.runtime.callsite.ConstructorSite$ConstructorSiteNoUnwrap.callConstructor(ConstructorSite.java:84) at org.codehaus.groovy.runtime.callsite.AbstractCallSite.callConstructor(AbstractCallSite.java:247) at io.restassured.internal.ResponseSpecificationImpl$HamcrestAssertionClosure.validate(ResponseSpecificationImpl.groovy:483) at io.restassured.internal.ResponseSpecificationImpl$HamcrestAssertionClosure$validate$1.call(Unknown Source) at io.restassured.internal.ResponseSpecificationImpl.validateResponseIfRequired(ResponseSpecificationImpl.groovy:655) at org.codehaus.groovy.runtime.callsite.PogoMetaMethodSite$PogoCachedMethodSiteNoUnwrapNoCoerce.invoke(PogoMetaMethodSite.java:210) at org.codehaus.groovy.runtime.callsite.PogoMetaMethodSite.callCurrent(PogoMetaMethodSite.java:59) at org.codehaus.groovy.runtime.callsite.AbstractCallSite.callCurrent(AbstractCallSite.java:166) at io.restassured.internal.ResponseSpecificationImpl.statusCode(ResponseSpecificationImpl.groovy:123) at io.restassured.specification.ResponseSpecification$statusCode$0.callCurrent(Unknown Source) at io.restassured.internal.ResponseSpecificationImpl.statusCode(ResponseSpecificationImpl.groovy:131) at io.restassured.internal.ValidatableResponseOptionsImpl.statusCode(ValidatableResponseOptionsImpl.java:119) at org.fcrepo.spec.testsuite.AbstractTest.createIndirectContainer(AbstractTest.java:207) at org.fcrepo.spec.testsuite.crud.Container.ldpIndirectContainerMustAllowMembershipPredicateToBeSetByDefault(Container.java:1017) at org.fcrepo.spec.testsuite.App.main(App.java:309) ... Removed 31 stack frames
ldpIndirectContainerMustSetLdpMembershipResourceByDefault
java.lang.AssertionError: 1 expectation failed. Expected status code <201> but was <409>. at org.codehaus.groovy.runtime.callsite.ConstructorSite$ConstructorSiteNoUnwrap.callConstructor(ConstructorSite.java:84) at org.codehaus.groovy.runtime.callsite.AbstractCallSite.callConstructor(AbstractCallSite.java:247) at io.restassured.internal.ResponseSpecificationImpl$HamcrestAssertionClosure.validate(ResponseSpecificationImpl.groovy:483) at io.restassured.internal.ResponseSpecificationImpl$HamcrestAssertionClosure$validate$1.call(Unknown Source) at io.restassured.internal.ResponseSpecificationImpl.validateResponseIfRequired(ResponseSpecificationImpl.groovy:655) at org.codehaus.groovy.runtime.callsite.PogoMetaMethodSite$PogoCachedMethodSiteNoUnwrapNoCoerce.invoke(PogoMetaMethodSite.java:210) at org.codehaus.groovy.runtime.callsite.PogoMetaMethodSite.callCurrent(PogoMetaMethodSite.java:59) at org.codehaus.groovy.runtime.callsite.AbstractCallSite.callCurrent(AbstractCallSite.java:166) at io.restassured.internal.ResponseSpecificationImpl.statusCode(ResponseSpecificationImpl.groovy:123) at io.restassured.specification.ResponseSpecification$statusCode$0.callCurrent(Unknown Source) at io.restassured.internal.ResponseSpecificationImpl.statusCode(ResponseSpecificationImpl.groovy:131) at io.restassured.internal.ValidatableResponseOptionsImpl.statusCode(ValidatableResponseOptionsImpl.java:119) at org.fcrepo.spec.testsuite.AbstractTest.createIndirectContainer(AbstractTest.java:207) at org.fcrepo.spec.testsuite.crud.Container.ldpIndirectContainerMustSetLdpMembershipResourceByDefault(Container.java:842) at org.fcrepo.spec.testsuite.App.main(App.java:309) ... Removed 31 stack frames
org.fcrepo.spec.testsuite.crud.HttpPost
postDigestResponseHeaderAuthentication
java.lang.AssertionError: 1 expectation failed. Expected status code <409> but was <201>. at org.codehaus.groovy.runtime.callsite.ConstructorSite$ConstructorSiteNoUnwrap.callConstructor(ConstructorSite.java:84) at org.codehaus.groovy.runtime.callsite.AbstractCallSite.callConstructor(AbstractCallSite.java:247) at io.restassured.internal.ResponseSpecificationImpl$HamcrestAssertionClosure.validate(ResponseSpecificationImpl.groovy:483) at io.restassured.internal.ResponseSpecificationImpl$HamcrestAssertionClosure$validate$1.call(Unknown Source) at io.restassured.internal.ResponseSpecificationImpl.validateResponseIfRequired(ResponseSpecificationImpl.groovy:655) at org.codehaus.groovy.runtime.callsite.PogoMetaMethodSite$PogoCachedMethodSiteNoUnwrapNoCoerce.invoke(PogoMetaMethodSite.java:210) at org.codehaus.groovy.runtime.callsite.PogoMetaMethodSite.callCurrent(PogoMetaMethodSite.java:59) at org.codehaus.groovy.runtime.callsite.AbstractCallSite.callCurrent(AbstractCallSite.java:166) at io.restassured.internal.ResponseSpecificationImpl.statusCode(ResponseSpecificationImpl.groovy:123) at io.restassured.specification.ResponseSpecification$statusCode$0.callCurrent(Unknown Source) at io.restassured.internal.ResponseSpecificationImpl.statusCode(ResponseSpecificationImpl.groovy:131) at io.restassured.internal.ValidatableResponseOptionsImpl.statusCode(ValidatableResponseOptionsImpl.java:119) at org.fcrepo.spec.testsuite.crud.HttpPost.postDigestResponseHeaderAuthentication(HttpPost.java:102) at org.fcrepo.spec.testsuite.App.main(App.java:309) ... Removed 31 stack frames
org.fcrepo.spec.testsuite.versioning.ResourceVersioning
postLdprWithType
java.lang.AssertionError: Link header with a value of <http://mementoweb.org/ns#OriginalResource>; rel="type" must be present but is not! expected [1] but found [0] at org.fcrepo.spec.testsuite.AbstractTest.confirmPresenceOfLinkValue(AbstractTest.java:561) at org.fcrepo.spec.testsuite.AbstractTest.confirmPresenceOfLinkValue(AbstractTest.java:557) at org.fcrepo.spec.testsuite.versioning.ResourceVersioning.postLdprWithType(ResourceVersioning.java:52) at org.fcrepo.spec.testsuite.App.main(App.java:309) ... Removed 27 stack frames
org.fcrepo.spec.testsuite.authz.WebACRepresentation
onlyAuthorizationStatementsUsed
java.lang.AssertionError: 1 expectation failed. Expected status code <403> but was <201>. at org.codehaus.groovy.runtime.callsite.ConstructorSite$ConstructorSiteNoUnwrap.callConstructor(ConstructorSite.java:84) at org.codehaus.groovy.runtime.callsite.AbstractCallSite.callConstructor(AbstractCallSite.java:247) at io.restassured.internal.ResponseSpecificationImpl$HamcrestAssertionClosure.validate(ResponseSpecificationImpl.groovy:483) at io.restassured.internal.ResponseSpecificationImpl$HamcrestAssertionClosure$validate$1.call(Unknown Source) at io.restassured.internal.ResponseSpecificationImpl.validateResponseIfRequired(ResponseSpecificationImpl.groovy:655) at org.codehaus.groovy.runtime.callsite.PogoMetaMethodSite$PogoCachedMethodSiteNoUnwrapNoCoerce.invoke(PogoMetaMethodSite.java:210) at org.codehaus.groovy.runtime.callsite.PogoMetaMethodSite.callCurrent(PogoMetaMethodSite.java:59) at org.codehaus.groovy.runtime.callsite.AbstractCallSite.callCurrent(AbstractCallSite.java:166) at io.restassured.internal.ResponseSpecificationImpl.statusCode(ResponseSpecificationImpl.groovy:123) at io.restassured.specification.ResponseSpecification$statusCode$0.callCurrent(Unknown Source) at io.restassured.internal.ResponseSpecificationImpl.statusCode(ResponseSpecificationImpl.groovy:131) at io.restassured.internal.ValidatableResponseOptionsImpl.statusCode(ValidatableResponseOptionsImpl.java:119) at org.fcrepo.spec.testsuite.authz.WebACRepresentation.onlyAuthorizationStatementsUsed(WebACRepresentation.java:72) at org.fcrepo.spec.testsuite.App.main(App.java:309) ... Removed 30 stack frames
org.fcrepo.spec.testsuite.crud.HttpPatch
disallowChangeResourceType
java.lang.AssertionError: 1 expectation failed. Expected status code <409> but was <204>. at org.codehaus.groovy.runtime.callsite.ConstructorSite$ConstructorSiteNoUnwrap.callConstructor(ConstructorSite.java:84) at org.codehaus.groovy.runtime.callsite.AbstractCallSite.callConstructor(AbstractCallSite.java:247) at io.restassured.internal.ResponseSpecificationImpl$HamcrestAssertionClosure.validate(ResponseSpecificationImpl.groovy:483) at io.restassured.internal.ResponseSpecificationImpl$HamcrestAssertionClosure$validate$1.call(Unknown Source) at io.restassured.internal.ResponseSpecificationImpl.validateResponseIfRequired(ResponseSpecificationImpl.groovy:655) at org.codehaus.groovy.runtime.callsite.PogoMetaMethodSite$PogoCachedMethodSiteNoUnwrapNoCoerce.invoke(PogoMetaMethodSite.java:210) at org.codehaus.groovy.runtime.callsite.PogoMetaMethodSite.callCurrent(PogoMetaMethodSite.java:59) at org.codehaus.groovy.runtime.callsite.AbstractCallSite.callCurrent(AbstractCallSite.java:166) at io.restassured.internal.ResponseSpecificationImpl.statusCode(ResponseSpecificationImpl.groovy:123) at io.restassured.specification.ResponseSpecification$statusCode$0.callCurrent(Unknown Source) at io.restassured.internal.ResponseSpecificationImpl.statusCode(ResponseSpecificationImpl.groovy:131) at io.restassured.internal.ValidatableResponseOptionsImpl.statusCode(ValidatableResponseOptionsImpl.java:119) at org.fcrepo.spec.testsuite.crud.HttpPatch.disallowChangeResourceType(HttpPatch.java:246) at org.fcrepo.spec.testsuite.App.main(App.java:309) ... Removed 30 stack frames
statementNotPersistedConstrainedBy
java.lang.AssertionError: 1 expectation failed. Expected status code <200> but was <301>. at org.codehaus.groovy.runtime.callsite.ConstructorSite$ConstructorSiteNoUnwrap.callConstructor(ConstructorSite.java:84) at org.codehaus.groovy.runtime.callsite.AbstractCallSite.callConstructor(AbstractCallSite.java:247) at io.restassured.internal.ResponseSpecificationImpl$HamcrestAssertionClosure.validate(ResponseSpecificationImpl.groovy:483) at io.restassured.internal.ResponseSpecificationImpl$HamcrestAssertionClosure$validate$1.call(Unknown Source) at io.restassured.internal.ResponseSpecificationImpl.validateResponseIfRequired(ResponseSpecificationImpl.groovy:655) at org.codehaus.groovy.runtime.callsite.PogoMetaMethodSite$PogoCachedMethodSiteNoUnwrapNoCoerce.invoke(PogoMetaMethodSite.java:210) at org.codehaus.groovy.runtime.callsite.PogoMetaMethodSite.callCurrent(PogoMetaMethodSite.java:59) at org.codehaus.groovy.runtime.callsite.AbstractCallSite.callCurrent(AbstractCallSite.java:166) at io.restassured.internal.ResponseSpecificationImpl.statusCode(ResponseSpecificationImpl.groovy:123) at io.restassured.specification.ResponseSpecification$statusCode$0.callCurrent(Unknown Source) at io.restassured.internal.ResponseSpecificationImpl.statusCode(ResponseSpecificationImpl.groovy:131) at io.restassured.internal.ValidatableResponseOptionsImpl.statusCode(ValidatableResponseOptionsImpl.java:119) at org.fcrepo.spec.testsuite.AbstractTest.doGet(AbstractTest.java:390) at org.fcrepo.spec.testsuite.AbstractTest.doGet(AbstractTest.java:396) at org.fcrepo.spec.testsuite.AbstractTest.confirmPresenceOfConstrainedByLink(AbstractTest.java:594) at org.fcrepo.spec.testsuite.crud.HttpPatch.statementNotPersistedConstrainedBy(HttpPatch.java:171) at org.fcrepo.spec.testsuite.App.main(App.java:309) ... Removed 30 stack frames
org.fcrepo.spec.testsuite.authz.WebACGeneral
resourceSingle
java.lang.AssertionError: 1 expectation failed. Expected status code <403> but was <200>. at org.codehaus.groovy.runtime.callsite.ConstructorSite$ConstructorSiteNoUnwrap.callConstructor(ConstructorSite.java:84) at org.codehaus.groovy.runtime.callsite.AbstractCallSite.callConstructor(AbstractCallSite.java:247) at io.restassured.internal.ResponseSpecificationImpl$HamcrestAssertionClosure.validate(ResponseSpecificationImpl.groovy:483) at io.restassured.internal.ResponseSpecificationImpl$HamcrestAssertionClosure$validate$1.call(Unknown Source) at io.restassured.internal.ResponseSpecificationImpl.validateResponseIfRequired(ResponseSpecificationImpl.groovy:655) at org.codehaus.groovy.runtime.callsite.PogoMetaMethodSite$PogoCachedMethodSiteNoUnwrapNoCoerce.invoke(PogoMetaMethodSite.java:210) at org.codehaus.groovy.runtime.callsite.PogoMetaMethodSite.callCurrent(PogoMetaMethodSite.java:59) at org.codehaus.groovy.runtime.callsite.AbstractCallSite.callCurrent(AbstractCallSite.java:166) at io.restassured.internal.ResponseSpecificationImpl.statusCode(ResponseSpecificationImpl.groovy:123) at io.restassured.specification.ResponseSpecification$statusCode$0.callCurrent(Unknown Source) at io.restassured.internal.ResponseSpecificationImpl.statusCode(ResponseSpecificationImpl.groovy:131) at io.restassured.internal.ValidatableResponseOptionsImpl.statusCode(ValidatableResponseOptionsImpl.java:119) at org.fcrepo.spec.testsuite.authz.WebACGeneral.resourceSingle(WebACGeneral.java:192) at org.fcrepo.spec.testsuite.App.main(App.java:309) ... Removed 30 stack frames
org.fcrepo.spec.testsuite.authz.WebACCrossDomain
rejectRemoteAclStatus
java.lang.AssertionError: 1 expectation failed. Expected status code <201> but was <409>. at org.codehaus.groovy.runtime.callsite.ConstructorSite$ConstructorSiteNoUnwrap.callConstructor(ConstructorSite.java:84) at org.codehaus.groovy.runtime.callsite.AbstractCallSite.callConstructor(AbstractCallSite.java:247) at io.restassured.internal.ResponseSpecificationImpl$HamcrestAssertionClosure.validate(ResponseSpecificationImpl.groovy:483) at io.restassured.internal.ResponseSpecificationImpl$HamcrestAssertionClosure$validate$1.call(Unknown Source) at io.restassured.internal.ResponseSpecificationImpl.validateResponseIfRequired(ResponseSpecificationImpl.groovy:655) at org.codehaus.groovy.runtime.callsite.PogoMetaMethodSite$PogoCachedMethodSiteNoUnwrapNoCoerce.invoke(PogoMetaMethodSite.java:210) at org.codehaus.groovy.runtime.callsite.PogoMetaMethodSite.callCurrent(PogoMetaMethodSite.java:59) at org.codehaus.groovy.runtime.callsite.AbstractCallSite.callCurrent(AbstractCallSite.java:166) at io.restassured.internal.ResponseSpecificationImpl.statusCode(ResponseSpecificationImpl.groovy:123) at io.restassured.specification.ResponseSpecification$statusCode$0.callCurrent(Unknown Source) at io.restassured.internal.ResponseSpecificationImpl.statusCode(ResponseSpecificationImpl.groovy:131) at io.restassured.internal.ValidatableResponseOptionsImpl.statusCode(ValidatableResponseOptionsImpl.java:119) at org.fcrepo.spec.testsuite.AbstractTest.createBasicContainer(AbstractTest.java:189) at org.fcrepo.spec.testsuite.AbstractTest.createBasicContainer(AbstractTest.java:179) at org.fcrepo.spec.testsuite.authz.AbstractAuthzTest.isClientAclLinkingSupported(AbstractAuthzTest.java:90) at org.fcrepo.spec.testsuite.authz.WebACCrossDomain.createResourceWithRemoteAcl(WebACCrossDomain.java:57) at org.fcrepo.spec.testsuite.authz.WebACCrossDomain.rejectRemoteAclStatus(WebACCrossDomain.java:79) at org.fcrepo.spec.testsuite.App.main(App.java:309) ... Removed 30 stack frames
org.fcrepo.spec.testsuite.crud.HttpGet
respondWantDigestMd5
java.lang.AssertionError: 1 expectation failed. Expected header "Digest" was not a string containing "md5", was "null". Headers are: Date=Mon, 09 Sep 2019 22:10:10 GMT Last-Modified=Mon, 09 Sep 2019 22:10:10 GMT Vary=Accept Vary=Accept-Datetime Vary=Range Link=<http://www.w3.org/ns/ldp#NonRDFSource>; rel="type" Link=<http://www.w3.org/ns/ldp#Resource>; rel="type" Link=<http://0.0.0.0:8080/testsuitecontainer09092019181007/3.2.3-A-1>; rel="original timegate" Link=<http://0.0.0.0:8080/testsuitecontainer09092019181007/3.2.3-A-1?ext=timemap>; rel="timemap"; from="Mon, 9 Sep 2019 22:10:10 GMT"; until="Mon, 9 Sep 2019 22:10:10 GMT"; type="application/link-format" Link=<http://0.0.0.0:8080/testsuitecontainer09092019181007/3.2.3-A-1?version=1568067010>; rel="first last memento"; datetime="Mon, 9 Sep 2019 22:10:10 GMT" Link=<http://0.0.0.0:8080/testsuitecontainer09092019181007/3.2.3-A-1>; rel="canonical" Link=<http://0.0.0.0:8080/testsuitecontainer09092019181007/3.2.3-A-1?ext=description>; rel="describedby" Link=<http://0.0.0.0:8080/testsuitecontainer09092019181007/3.2.3-A-1>; rel="self" Link=<http://0.0.0.0:8080/testsuitecontainer09092019181007/3.2.3-A-1?ext=acl>; rel="acl" Accept-Patch=application/sparql-update Content-Type=text/plain;charset=iso-8859-1 Accept-Ranges=bytes ETag="c68613199bfe3b5cfd2611c0a4c23db8" Allow=GET,HEAD,OPTIONS,PUT,DELETE Cache-Control=no-transform, must-revalidate, max-age=86400 Vary=Accept-Encoding Content-Length=10 at org.codehaus.groovy.runtime.callsite.ConstructorSite$ConstructorSiteNoUnwrap.callConstructor(ConstructorSite.java:84) at org.codehaus.groovy.runtime.callsite.AbstractCallSite.callConstructor(AbstractCallSite.java:247) at io.restassured.internal.ResponseSpecificationImpl$HamcrestAssertionClosure.validate(ResponseSpecificationImpl.groovy:483) at io.restassured.internal.ResponseSpecificationImpl$HamcrestAssertionClosure$validate$1.call(Unknown Source) at io.restassured.internal.ResponseSpecificationImpl.validateResponseIfRequired(ResponseSpecificationImpl.groovy:655) at org.codehaus.groovy.runtime.callsite.PogoMetaMethodSite$PogoCachedMethodSiteNoUnwrapNoCoerce.invoke(PogoMetaMethodSite.java:210) at org.codehaus.groovy.runtime.callsite.PogoMetaMethodSite.callCurrent(PogoMetaMethodSite.java:59) at org.codehaus.groovy.runtime.callsite.CallSiteArray.defaultCallCurrent(CallSiteArray.java:52) at org.codehaus.groovy.runtime.callsite.AbstractCallSite.callCurrent(AbstractCallSite.java:154) at org.codehaus.groovy.runtime.callsite.AbstractCallSite.callCurrent(AbstractCallSite.java:166) at io.restassured.internal.ResponseSpecificationImpl.header(ResponseSpecificationImpl.groovy:178) at io.restassured.internal.ValidatableResponseOptionsImpl.header(ValidatableResponseOptionsImpl.java:144) at org.fcrepo.spec.testsuite.crud.HttpGet.respondWantDigestMd5(HttpGet.java:190) at org.fcrepo.spec.testsuite.App.main(App.java:309) ... Removed 31 stack frames
respondWantDigestNonSupported
java.lang.AssertionError: 1 expectation failed. Expected status code <400> but was <200>. at org.codehaus.groovy.runtime.callsite.ConstructorSite$ConstructorSiteNoUnwrap.callConstructor(ConstructorSite.java:84) at org.codehaus.groovy.runtime.callsite.AbstractCallSite.callConstructor(AbstractCallSite.java:247) at io.restassured.internal.ResponseSpecificationImpl$HamcrestAssertionClosure.validate(ResponseSpecificationImpl.groovy:483) at io.restassured.internal.ResponseSpecificationImpl$HamcrestAssertionClosure$validate$1.call(Unknown Source) at io.restassured.internal.ResponseSpecificationImpl.validateResponseIfRequired(ResponseSpecificationImpl.groovy:655) at org.codehaus.groovy.runtime.callsite.PogoMetaMethodSite$PogoCachedMethodSiteNoUnwrapNoCoerce.invoke(PogoMetaMethodSite.java:210) at org.codehaus.groovy.runtime.callsite.PogoMetaMethodSite.callCurrent(PogoMetaMethodSite.java:59) at org.codehaus.groovy.runtime.callsite.AbstractCallSite.callCurrent(AbstractCallSite.java:166) at io.restassured.internal.ResponseSpecificationImpl.statusCode(ResponseSpecificationImpl.groovy:123) at io.restassured.specification.ResponseSpecification$statusCode$0.callCurrent(Unknown Source) at io.restassured.internal.ResponseSpecificationImpl.statusCode(ResponseSpecificationImpl.groovy:131) at io.restassured.internal.ValidatableResponseOptionsImpl.statusCode(ValidatableResponseOptionsImpl.java:119) at org.fcrepo.spec.testsuite.crud.HttpGet.respondWantDigestNonSupported(HttpGet.java:372) at org.fcrepo.spec.testsuite.App.main(App.java:309) ... Removed 31 stack frames
respondWantDigestNonSupportedWithSupported
java.lang.AssertionError: 1 expectation failed. Expected header "Digest" was not a string containing "md5", was "null". Headers are: Date=Mon, 09 Sep 2019 22:10:10 GMT Last-Modified=Mon, 09 Sep 2019 22:10:10 GMT Vary=Accept Vary=Accept-Datetime Vary=Range Link=<http://www.w3.org/ns/ldp#NonRDFSource>; rel="type" Link=<http://www.w3.org/ns/ldp#Resource>; rel="type" Link=<http://0.0.0.0:8080/testsuitecontainer09092019181007/3.2.3-E>; rel="original timegate" Link=<http://0.0.0.0:8080/testsuitecontainer09092019181007/3.2.3-E?ext=timemap>; rel="timemap"; from="Mon, 9 Sep 2019 22:10:10 GMT"; until="Mon, 9 Sep 2019 22:10:10 GMT"; type="application/link-format" Link=<http://0.0.0.0:8080/testsuitecontainer09092019181007/3.2.3-E?version=1568067010>; rel="first last memento"; datetime="Mon, 9 Sep 2019 22:10:10 GMT" Link=<http://0.0.0.0:8080/testsuitecontainer09092019181007/3.2.3-E>; rel="canonical" Link=<http://0.0.0.0:8080/testsuitecontainer09092019181007/3.2.3-E?ext=description>; rel="describedby" Link=<http://0.0.0.0:8080/testsuitecontainer09092019181007/3.2.3-E>; rel="self" Link=<http://0.0.0.0:8080/testsuitecontainer09092019181007/3.2.3-E?ext=acl>; rel="acl" Accept-Patch=application/sparql-update Content-Type=text/plain;charset=iso-8859-1 Accept-Ranges=bytes ETag="7b99319a927a08a12d3342c5d000cfd4" Allow=GET,HEAD,OPTIONS,PUT,DELETE Cache-Control=no-transform, must-revalidate, max-age=86400 Vary=Accept-Encoding Content-Length=10 at org.codehaus.groovy.runtime.callsite.ConstructorSite$ConstructorSiteNoUnwrap.callConstructor(ConstructorSite.java:84) at org.codehaus.groovy.runtime.callsite.AbstractCallSite.callConstructor(AbstractCallSite.java:247) at io.restassured.internal.ResponseSpecificationImpl$HamcrestAssertionClosure.validate(ResponseSpecificationImpl.groovy:483) at io.restassured.internal.ResponseSpecificationImpl$HamcrestAssertionClosure$validate$1.call(Unknown Source) at io.restassured.internal.ResponseSpecificationImpl.validateResponseIfRequired(ResponseSpecificationImpl.groovy:655) at org.codehaus.groovy.runtime.callsite.PogoMetaMethodSite$PogoCachedMethodSiteNoUnwrapNoCoerce.invoke(PogoMetaMethodSite.java:210) at org.codehaus.groovy.runtime.callsite.PogoMetaMethodSite.callCurrent(PogoMetaMethodSite.java:59) at org.codehaus.groovy.runtime.callsite.AbstractCallSite.callCurrent(AbstractCallSite.java:166) at io.restassured.internal.ResponseSpecificationImpl.header(ResponseSpecificationImpl.groovy:178) at io.restassured.internal.ValidatableResponseOptionsImpl.header(ValidatableResponseOptionsImpl.java:144) at org.fcrepo.spec.testsuite.crud.HttpGet.respondWantDigestNonSupportedWithSupported(HttpGet.java:349) at org.fcrepo.spec.testsuite.App.main(App.java:309) ... Removed 31 stack frames
respondWantDigestSha1
java.lang.AssertionError: 1 expectation failed. Expected header "Digest" was not a string containing "sha", was "null". Headers are: Date=Mon, 09 Sep 2019 22:10:10 GMT Last-Modified=Mon, 09 Sep 2019 22:10:10 GMT Vary=Accept Vary=Accept-Datetime Vary=Range Link=<http://www.w3.org/ns/ldp#NonRDFSource>; rel="type" Link=<http://www.w3.org/ns/ldp#Resource>; rel="type" Link=<http://0.0.0.0:8080/testsuitecontainer09092019181007/3.2.3-A-2>; rel="original timegate" Link=<http://0.0.0.0:8080/testsuitecontainer09092019181007/3.2.3-A-2?ext=timemap>; rel="timemap"; from="Mon, 9 Sep 2019 22:10:10 GMT"; until="Mon, 9 Sep 2019 22:10:10 GMT"; type="application/link-format" Link=<http://0.0.0.0:8080/testsuitecontainer09092019181007/3.2.3-A-2?version=1568067010>; rel="first last memento"; datetime="Mon, 9 Sep 2019 22:10:10 GMT" Link=<http://0.0.0.0:8080/testsuitecontainer09092019181007/3.2.3-A-2>; rel="canonical" Link=<http://0.0.0.0:8080/testsuitecontainer09092019181007/3.2.3-A-2?ext=description>; rel="describedby" Link=<http://0.0.0.0:8080/testsuitecontainer09092019181007/3.2.3-A-2>; rel="self" Link=<http://0.0.0.0:8080/testsuitecontainer09092019181007/3.2.3-A-2?ext=acl>; rel="acl" Accept-Patch=application/sparql-update Content-Type=text/plain;charset=iso-8859-1 Accept-Ranges=bytes ETag="79d75eb5d6e33e75b589e20afc9a007e" Allow=GET,HEAD,OPTIONS,PUT,DELETE Cache-Control=no-transform, must-revalidate, max-age=86400 Vary=Accept-Encoding Content-Length=10 at org.codehaus.groovy.runtime.callsite.ConstructorSite$ConstructorSiteNoUnwrap.callConstructor(ConstructorSite.java:84) at org.codehaus.groovy.runtime.callsite.AbstractCallSite.callConstructor(AbstractCallSite.java:247) at io.restassured.internal.ResponseSpecificationImpl$HamcrestAssertionClosure.validate(ResponseSpecificationImpl.groovy:483) at io.restassured.internal.ResponseSpecificationImpl$HamcrestAssertionClosure$validate$1.call(Unknown Source) at io.restassured.internal.ResponseSpecificationImpl.validateResponseIfRequired(ResponseSpecificationImpl.groovy:655) at org.codehaus.groovy.runtime.callsite.PogoMetaMethodSite$PogoCachedMethodSiteNoUnwrapNoCoerce.invoke(PogoMetaMethodSite.java:210) at org.codehaus.groovy.runtime.callsite.PogoMetaMethodSite.callCurrent(PogoMetaMethodSite.java:59) at org.codehaus.groovy.runtime.callsite.AbstractCallSite.callCurrent(AbstractCallSite.java:166) at io.restassured.internal.ResponseSpecificationImpl.header(ResponseSpecificationImpl.groovy:178) at io.restassured.internal.ValidatableResponseOptionsImpl.header(ValidatableResponseOptionsImpl.java:144) at org.fcrepo.spec.testsuite.crud.HttpGet.respondWantDigestSha1(HttpGet.java:214) at org.fcrepo.spec.testsuite.App.main(App.java:309) ... Removed 31 stack frames
respondWantDigestSha256
java.lang.AssertionError: 1 expectation failed. Expected header "Digest" was not a string containing "sha-256", was "null". Headers are: Date=Mon, 09 Sep 2019 22:10:10 GMT Last-Modified=Mon, 09 Sep 2019 22:10:10 GMT Vary=Accept Vary=Accept-Datetime Vary=Range Link=<http://www.w3.org/ns/ldp#NonRDFSource>; rel="type" Link=<http://www.w3.org/ns/ldp#Resource>; rel="type" Link=<http://0.0.0.0:8080/testsuitecontainer09092019181007/3.2.3-A-3>; rel="original timegate" Link=<http://0.0.0.0:8080/testsuitecontainer09092019181007/3.2.3-A-3?ext=timemap>; rel="timemap"; from="Mon, 9 Sep 2019 22:10:10 GMT"; until="Mon, 9 Sep 2019 22:10:10 GMT"; type="application/link-format" Link=<http://0.0.0.0:8080/testsuitecontainer09092019181007/3.2.3-A-3?version=1568067010>; rel="first last memento"; datetime="Mon, 9 Sep 2019 22:10:10 GMT" Link=<http://0.0.0.0:8080/testsuitecontainer09092019181007/3.2.3-A-3>; rel="canonical" Link=<http://0.0.0.0:8080/testsuitecontainer09092019181007/3.2.3-A-3?ext=description>; rel="describedby" Link=<http://0.0.0.0:8080/testsuitecontainer09092019181007/3.2.3-A-3>; rel="self" Link=<http://0.0.0.0:8080/testsuitecontainer09092019181007/3.2.3-A-3?ext=acl>; rel="acl" Accept-Patch=application/sparql-update Content-Type=text/plain;charset=iso-8859-1 Accept-Ranges=bytes ETag="5466cad3133f0acbed44d8f983126b81" Allow=GET,HEAD,OPTIONS,PUT,DELETE Cache-Control=no-transform, must-revalidate, max-age=86400 Vary=Accept-Encoding Content-Length=10 at org.codehaus.groovy.runtime.callsite.ConstructorSite$ConstructorSiteNoUnwrap.callConstructor(ConstructorSite.java:84) at org.codehaus.groovy.runtime.callsite.AbstractCallSite.callConstructor(AbstractCallSite.java:247) at io.restassured.internal.ResponseSpecificationImpl$HamcrestAssertionClosure.validate(ResponseSpecificationImpl.groovy:483) at io.restassured.internal.ResponseSpecificationImpl$HamcrestAssertionClosure$validate$1.call(Unknown Source) at io.restassured.internal.ResponseSpecificationImpl.validateResponseIfRequired(ResponseSpecificationImpl.groovy:655) at org.codehaus.groovy.runtime.callsite.PogoMetaMethodSite$PogoCachedMethodSiteNoUnwrapNoCoerce.invoke(PogoMetaMethodSite.java:210) at org.codehaus.groovy.runtime.callsite.PogoMetaMethodSite.callCurrent(PogoMetaMethodSite.java:59) at org.codehaus.groovy.runtime.callsite.AbstractCallSite.callCurrent(AbstractCallSite.java:166) at io.restassured.internal.ResponseSpecificationImpl.header(ResponseSpecificationImpl.groovy:178) at io.restassured.internal.ValidatableResponseOptionsImpl.header(ValidatableResponseOptionsImpl.java:144) at org.fcrepo.spec.testsuite.crud.HttpGet.respondWantDigestSha256(HttpGet.java:238) at org.fcrepo.spec.testsuite.App.main(App.java:309) ... Removed 31 stack frames
respondWantDigestTwoSupported
java.lang.NullPointerException at org.fcrepo.spec.testsuite.crud.HttpGet.respondWantDigestTwoSupported(HttpGet.java:269) at org.fcrepo.spec.testsuite.App.main(App.java:309) ... Removed 22 stack frames
respondWantDigestTwoSupportedQvalueNonZero
java.lang.NullPointerException at org.fcrepo.spec.testsuite.crud.HttpGet.respondWantDigestTwoSupportedQvalueNonZero(HttpGet.java:302) at org.fcrepo.spec.testsuite.App.main(App.java:309) ... Removed 22 stack frames
respondWantDigestTwoSupportedQvalueZero
java.lang.AssertionError: 1 expectation failed. Expected header "Digest" was not a string containing "md5", was "null". Headers are: Date=Mon, 09 Sep 2019 22:10:10 GMT Last-Modified=Mon, 09 Sep 2019 22:10:10 GMT Vary=Accept Vary=Accept-Datetime Vary=Range Link=<http://www.w3.org/ns/ldp#NonRDFSource>; rel="type" Link=<http://www.w3.org/ns/ldp#Resource>; rel="type" Link=<http://0.0.0.0:8080/testsuitecontainer09092019181007/3.2.3-D>; rel="original timegate" Link=<http://0.0.0.0:8080/testsuitecontainer09092019181007/3.2.3-D?ext=timemap>; rel="timemap"; from="Mon, 9 Sep 2019 22:10:10 GMT"; until="Mon, 9 Sep 2019 22:10:10 GMT"; type="application/link-format" Link=<http://0.0.0.0:8080/testsuitecontainer09092019181007/3.2.3-D?version=1568067010>; rel="first last memento"; datetime="Mon, 9 Sep 2019 22:10:10 GMT" Link=<http://0.0.0.0:8080/testsuitecontainer09092019181007/3.2.3-D>; rel="canonical" Link=<http://0.0.0.0:8080/testsuitecontainer09092019181007/3.2.3-D?ext=description>; rel="describedby" Link=<http://0.0.0.0:8080/testsuitecontainer09092019181007/3.2.3-D>; rel="self" Link=<http://0.0.0.0:8080/testsuitecontainer09092019181007/3.2.3-D?ext=acl>; rel="acl" Accept-Patch=application/sparql-update Content-Type=text/plain;charset=iso-8859-1 Accept-Ranges=bytes ETag="9e8465dd174639bb8308d6de244bce05" Allow=GET,HEAD,OPTIONS,PUT,DELETE Cache-Control=no-transform, must-revalidate, max-age=86400 Vary=Accept-Encoding Content-Length=10 at org.codehaus.groovy.runtime.callsite.ConstructorSite$ConstructorSiteNoUnwrap.callConstructor(ConstructorSite.java:84) at org.codehaus.groovy.runtime.callsite.AbstractCallSite.callConstructor(AbstractCallSite.java:247) at io.restassured.internal.ResponseSpecificationImpl$HamcrestAssertionClosure.validate(ResponseSpecificationImpl.groovy:483) at io.restassured.internal.ResponseSpecificationImpl$HamcrestAssertionClosure$validate$1.call(Unknown Source) at io.restassured.internal.ResponseSpecificationImpl.validateResponseIfRequired(ResponseSpecificationImpl.groovy:655) at org.codehaus.groovy.runtime.callsite.PogoMetaMethodSite$PogoCachedMethodSiteNoUnwrapNoCoerce.invoke(PogoMetaMethodSite.java:210) at org.codehaus.groovy.runtime.callsite.PogoMetaMethodSite.callCurrent(PogoMetaMethodSite.java:59) at org.codehaus.groovy.runtime.callsite.AbstractCallSite.callCurrent(AbstractCallSite.java:166) at io.restassured.internal.ResponseSpecificationImpl.header(ResponseSpecificationImpl.groovy:178) at io.restassured.internal.ValidatableResponseOptionsImpl.header(ValidatableResponseOptionsImpl.java:144) at org.fcrepo.spec.testsuite.crud.HttpGet.respondWantDigestTwoSupportedQvalueZero(HttpGet.java:326) at org.fcrepo.spec.testsuite.App.main(App.java:309) ... Removed 31 stack frames
org.fcrepo.spec.testsuite.authz.WebACModes
appendAllowedPATCH
java.lang.AssertionError: 1 expectation failed. Expected status code (a value equal to or greater than <200> and a value less than <300>) but a value less than <300> <403> was greater than <300>. at org.codehaus.groovy.runtime.callsite.ConstructorSite$ConstructorSiteNoUnwrap.callConstructor(ConstructorSite.java:84) at org.codehaus.groovy.runtime.callsite.AbstractCallSite.callConstructor(AbstractCallSite.java:247) at io.restassured.internal.ResponseSpecificationImpl$HamcrestAssertionClosure.validate(ResponseSpecificationImpl.groovy:483) at io.restassured.internal.ResponseSpecificationImpl$HamcrestAssertionClosure$validate$1.call(Unknown Source) at io.restassured.internal.ResponseSpecificationImpl.validateResponseIfRequired(ResponseSpecificationImpl.groovy:655) at org.codehaus.groovy.runtime.callsite.PogoMetaMethodSite$PogoCachedMethodSiteNoUnwrapNoCoerce.invoke(PogoMetaMethodSite.java:210) at org.codehaus.groovy.runtime.callsite.PogoMetaMethodSite.callCurrent(PogoMetaMethodSite.java:59) at org.codehaus.groovy.runtime.callsite.AbstractCallSite.callCurrent(AbstractCallSite.java:166) at io.restassured.internal.ResponseSpecificationImpl.statusCode(ResponseSpecificationImpl.groovy:123) at io.restassured.internal.ValidatableResponseOptionsImpl.statusCode(ValidatableResponseOptionsImpl.java:114) at org.fcrepo.spec.testsuite.AbstractTest.doPatch(AbstractTest.java:450) at org.fcrepo.spec.testsuite.authz.WebACModes.appendAllowedPATCH(WebACModes.java:296) at org.fcrepo.spec.testsuite.App.main(App.java:309) ... Removed 31 stack frames
appendNotWritePutToCreate
java.lang.AssertionError: 1 expectation failed. Expected status code <201> but was <403>. at org.codehaus.groovy.runtime.callsite.ConstructorSite$ConstructorSiteNoUnwrap.callConstructor(ConstructorSite.java:84) at org.codehaus.groovy.runtime.callsite.AbstractCallSite.callConstructor(AbstractCallSite.java:247) at io.restassured.internal.ResponseSpecificationImpl$HamcrestAssertionClosure.validate(ResponseSpecificationImpl.groovy:483) at io.restassured.internal.ResponseSpecificationImpl$HamcrestAssertionClosure$validate$1.call(Unknown Source) at io.restassured.internal.ResponseSpecificationImpl.validateResponseIfRequired(ResponseSpecificationImpl.groovy:655) at org.codehaus.groovy.runtime.callsite.PogoMetaMethodSite$PogoCachedMethodSiteNoUnwrapNoCoerce.invoke(PogoMetaMethodSite.java:210) at org.codehaus.groovy.runtime.callsite.PogoMetaMethodSite.callCurrent(PogoMetaMethodSite.java:59) at org.codehaus.groovy.runtime.callsite.AbstractCallSite.callCurrent(AbstractCallSite.java:166) at io.restassured.internal.ResponseSpecificationImpl.statusCode(ResponseSpecificationImpl.groovy:123) at io.restassured.specification.ResponseSpecification$statusCode$0.callCurrent(Unknown Source) at io.restassured.internal.ResponseSpecificationImpl.statusCode(ResponseSpecificationImpl.groovy:131) at io.restassured.internal.ValidatableResponseOptionsImpl.statusCode(ValidatableResponseOptionsImpl.java:119) at org.fcrepo.spec.testsuite.authz.WebACModes.appendNotWritePutToCreate(WebACModes.java:539) at org.fcrepo.spec.testsuite.App.main(App.java:309) ... Removed 31 stack frames
org.fcrepo.spec.testsuite.crud.HttpPut
httpPutUpdateDisallowedTriples
java.lang.AssertionError: 1 expectation failed. Expected status code (a value equal to or greater than <400> and a value less than <500>) but a value equal to or greater than <400> <204> was less than <400>. at org.codehaus.groovy.runtime.callsite.ConstructorSite$ConstructorSiteNoUnwrap.callConstructor(ConstructorSite.java:84) at org.codehaus.groovy.runtime.callsite.AbstractCallSite.callConstructor(AbstractCallSite.java:247) at io.restassured.internal.ResponseSpecificationImpl$HamcrestAssertionClosure.validate(ResponseSpecificationImpl.groovy:483) at io.restassured.internal.ResponseSpecificationImpl$HamcrestAssertionClosure$validate$1.call(Unknown Source) at io.restassured.internal.ResponseSpecificationImpl.validateResponseIfRequired(ResponseSpecificationImpl.groovy:655) at org.codehaus.groovy.runtime.callsite.PogoMetaMethodSite$PogoCachedMethodSiteNoUnwrapNoCoerce.invoke(PogoMetaMethodSite.java:210) at org.codehaus.groovy.runtime.callsite.PogoMetaMethodSite.callCurrent(PogoMetaMethodSite.java:59) at org.codehaus.groovy.runtime.callsite.AbstractCallSite.callCurrent(AbstractCallSite.java:166) at io.restassured.internal.ResponseSpecificationImpl.statusCode(ResponseSpecificationImpl.groovy:123) at io.restassured.internal.ValidatableResponseOptionsImpl.statusCode(ValidatableResponseOptionsImpl.java:114) at org.fcrepo.spec.testsuite.crud.HttpPut.httpPutUpdateDisallowedTriples(HttpPut.java:188) at org.fcrepo.spec.testsuite.App.main(App.java:309) ... Removed 31 stack frames
httpPutUpdateDisallowedTriplesConstrainedByHeader
java.lang.AssertionError: 1 expectation failed. Expected status code <409> but was <204>. at org.codehaus.groovy.runtime.callsite.ConstructorSite$ConstructorSiteNoUnwrap.callConstructor(ConstructorSite.java:84) at org.codehaus.groovy.runtime.callsite.AbstractCallSite.callConstructor(AbstractCallSite.java:247) at io.restassured.internal.ResponseSpecificationImpl$HamcrestAssertionClosure.validate(ResponseSpecificationImpl.groovy:483) at io.restassured.internal.ResponseSpecificationImpl$HamcrestAssertionClosure$validate$1.call(Unknown Source) at io.restassured.internal.ResponseSpecificationImpl.validateResponseIfRequired(ResponseSpecificationImpl.groovy:655) at org.codehaus.groovy.runtime.callsite.PogoMetaMethodSite$PogoCachedMethodSiteNoUnwrapNoCoerce.invoke(PogoMetaMethodSite.java:210) at org.codehaus.groovy.runtime.callsite.PogoMetaMethodSite.callCurrent(PogoMetaMethodSite.java:59) at org.codehaus.groovy.runtime.callsite.AbstractCallSite.callCurrent(AbstractCallSite.java:166) at io.restassured.internal.ResponseSpecificationImpl.statusCode(ResponseSpecificationImpl.groovy:123) at io.restassured.specification.ResponseSpecification$statusCode$0.callCurrent(Unknown Source) at io.restassured.internal.ResponseSpecificationImpl.statusCode(ResponseSpecificationImpl.groovy:131) at io.restassured.internal.ValidatableResponseOptionsImpl.statusCode(ValidatableResponseOptionsImpl.java:119) at org.fcrepo.spec.testsuite.crud.HttpPut.httpPutUpdateDisallowedTriplesConstrainedByHeader(HttpPut.java:274) at org.fcrepo.spec.testsuite.App.main(App.java:309) ... Removed 31 stack frames
httpPutUpdateDisallowedTriplesResponse
java.lang.AssertionError: 1 expectation failed. Expected status code <409> but was <204>. at org.codehaus.groovy.runtime.callsite.ConstructorSite$ConstructorSiteNoUnwrap.callConstructor(ConstructorSite.java:84) at org.codehaus.groovy.runtime.callsite.AbstractCallSite.callConstructor(AbstractCallSite.java:247) at io.restassured.internal.ResponseSpecificationImpl$HamcrestAssertionClosure.validate(ResponseSpecificationImpl.groovy:483) at io.restassured.internal.ResponseSpecificationImpl$HamcrestAssertionClosure$validate$1.call(Unknown Source) at io.restassured.internal.ResponseSpecificationImpl.validateResponseIfRequired(ResponseSpecificationImpl.groovy:655) at org.codehaus.groovy.runtime.callsite.PogoMetaMethodSite$PogoCachedMethodSiteNoUnwrapNoCoerce.invoke(PogoMetaMethodSite.java:210) at org.codehaus.groovy.runtime.callsite.PogoMetaMethodSite.callCurrent(PogoMetaMethodSite.java:59) at org.codehaus.groovy.runtime.callsite.AbstractCallSite.callCurrent(AbstractCallSite.java:166) at io.restassured.internal.ResponseSpecificationImpl.statusCode(ResponseSpecificationImpl.groovy:123) at io.restassured.specification.ResponseSpecification$statusCode$0.callCurrent(Unknown Source) at io.restassured.internal.ResponseSpecificationImpl.statusCode(ResponseSpecificationImpl.groovy:131) at io.restassured.internal.ValidatableResponseOptionsImpl.statusCode(ValidatableResponseOptionsImpl.java:119) at org.fcrepo.spec.testsuite.crud.HttpPut.httpPutUpdateDisallowedTriplesResponse(HttpPut.java:229) at org.fcrepo.spec.testsuite.App.main(App.java:309) ... Removed 30 stack frames
nonRDFSourcePutDigestResponseHeaderAuthentication
java.lang.AssertionError: 1 expectation failed. Expected status code <409> but was <204>. at org.codehaus.groovy.runtime.callsite.ConstructorSite$ConstructorSiteNoUnwrap.callConstructor(ConstructorSite.java:84) at org.codehaus.groovy.runtime.callsite.AbstractCallSite.callConstructor(AbstractCallSite.java:247) at io.restassured.internal.ResponseSpecificationImpl$HamcrestAssertionClosure.validate(ResponseSpecificationImpl.groovy:483) at io.restassured.internal.ResponseSpecificationImpl$HamcrestAssertionClosure$validate$1.call(Unknown Source) at io.restassured.internal.ResponseSpecificationImpl.validateResponseIfRequired(ResponseSpecificationImpl.groovy:655) at org.codehaus.groovy.runtime.callsite.PogoMetaMethodSite$PogoCachedMethodSiteNoUnwrapNoCoerce.invoke(PogoMetaMethodSite.java:210) at org.codehaus.groovy.runtime.callsite.PogoMetaMethodSite.callCurrent(PogoMetaMethodSite.java:59) at org.codehaus.groovy.runtime.callsite.AbstractCallSite.callCurrent(AbstractCallSite.java:166) at io.restassured.internal.ResponseSpecificationImpl.statusCode(ResponseSpecificationImpl.groovy:123) at io.restassured.specification.ResponseSpecification$statusCode$0.callCurrent(Unknown Source) at io.restassured.internal.ResponseSpecificationImpl.statusCode(ResponseSpecificationImpl.groovy:131) at io.restassured.internal.ValidatableResponseOptionsImpl.statusCode(ValidatableResponseOptionsImpl.java:119) at org.fcrepo.spec.testsuite.crud.HttpPut.nonRDFSourcePutDigestResponseHeaderAuthentication(HttpPut.java:337) at org.fcrepo.spec.testsuite.App.main(App.java:309) ... Removed 30 stack frames
org.fcrepo.spec.testsuite.crud.ExternalBinaryContent
unsupportedExternalBinaryContentConstraint
java.lang.AssertionError: Response does not contain a link of rel type = http://www.w3.org/ns/ldp#constrainedBy at org.fcrepo.spec.testsuite.AbstractTest.confirmPresenceOfConstrainedByLink(AbstractTest.java:591) at org.fcrepo.spec.testsuite.crud.ExternalBinaryContent.unsupportedExternalBinaryContentConstraint(ExternalBinaryContent.java:536) at org.fcrepo.spec.testsuite.App.main(App.java:309) ... Removed 23 stack frames
unsupportedExternalBinaryContentStatus
java.lang.AssertionError: 1 expectation failed. Expected status code (a value equal to or greater than <400> and a value less than <500>) but a value equal to or greater than <400> <201> was less than <400>. at org.codehaus.groovy.runtime.callsite.ConstructorSite$ConstructorSiteNoUnwrap.callConstructor(ConstructorSite.java:84) at org.codehaus.groovy.runtime.callsite.AbstractCallSite.callConstructor(AbstractCallSite.java:247) at io.restassured.internal.ResponseSpecificationImpl$HamcrestAssertionClosure.validate(ResponseSpecificationImpl.groovy:483) at io.restassured.internal.ResponseSpecificationImpl$HamcrestAssertionClosure$validate$1.call(Unknown Source) at io.restassured.internal.ResponseSpecificationImpl.validateResponseIfRequired(ResponseSpecificationImpl.groovy:655) at org.codehaus.groovy.runtime.callsite.PogoMetaMethodSite$PogoCachedMethodSiteNoUnwrapNoCoerce.invoke(PogoMetaMethodSite.java:210) at org.codehaus.groovy.runtime.callsite.PogoMetaMethodSite.callCurrent(PogoMetaMethodSite.java:59) at org.codehaus.groovy.runtime.callsite.AbstractCallSite.callCurrent(AbstractCallSite.java:166) at io.restassured.internal.ResponseSpecificationImpl.statusCode(ResponseSpecificationImpl.groovy:123) at io.restassured.internal.ValidatableResponseOptionsImpl.statusCode(ValidatableResponseOptionsImpl.java:114) at org.fcrepo.spec.testsuite.crud.ExternalBinaryContent.unsupportedExternalBinaryContentStatus(ExternalBinaryContent.java:514) at org.fcrepo.spec.testsuite.App.main(App.java:309) ... Removed 30 stack frames
org.fcrepo.spec.testsuite.versioning.LdprmHttpGet
ldpnrmMustHaveMementoLinkHeader
java.lang.AssertionError: Link header with a value of <http://mementoweb.org/ns#Memento>; rel="type" must be present but is not! expected [1] but found [0] at org.fcrepo.spec.testsuite.AbstractTest.confirmPresenceOfLinkValue(AbstractTest.java:561) at org.fcrepo.spec.testsuite.AbstractTest.confirmPresenceOfLinkValue(AbstractTest.java:557) at org.fcrepo.spec.testsuite.versioning.LdprmHttpGet.ldpnrmMustHaveMementoLinkHeader(LdprmHttpGet.java:168) at org.fcrepo.spec.testsuite.App.main(App.java:309) ... Removed 27 stack frames
ldprmMustHaveMementoLinkHeader
java.lang.AssertionError: Link header with a value of <http://mementoweb.org/ns#Memento>; rel="type" must be present but is not! expected [1] but found [0] at org.fcrepo.spec.testsuite.AbstractTest.confirmPresenceOfLinkValue(AbstractTest.java:561) at org.fcrepo.spec.testsuite.AbstractTest.confirmPresenceOfLinkValue(AbstractTest.java:557) at org.fcrepo.spec.testsuite.versioning.LdprmHttpGet.ldprmMustHaveMementoLinkHeader(LdprmHttpGet.java:147) at org.fcrepo.spec.testsuite.App.main(App.java:309) ... Removed 27 stack frames
org.fcrepo.spec.testsuite.versioning.LdpcvHttpGet
ldpcvMustHaveContainerLinkHeader
java.lang.AssertionError: Link header with a value of <http://www.w3.org/ns/ldp#Container>; rel="type" must be present but is not! expected [1] but found [0] at org.fcrepo.spec.testsuite.AbstractTest.confirmPresenceOfLinkValue(AbstractTest.java:561) at org.fcrepo.spec.testsuite.AbstractTest.confirmPresenceOfLinkValue(AbstractTest.java:557) at org.fcrepo.spec.testsuite.versioning.LdpcvHttpGet.ldpcvMustHaveContainerLinkHeader(LdpcvHttpGet.java:158) at org.fcrepo.spec.testsuite.App.main(App.java:309) ... Removed 27 stack frames
ldpcvMustHaveTimeMapLinkHeader
java.lang.AssertionError: Link header with a value of <http://mementoweb.org/ns#TimeMap>; rel="type" must be present but is not! expected [1] but found [0] at org.fcrepo.spec.testsuite.AbstractTest.confirmPresenceOfLinkValue(AbstractTest.java:561) at org.fcrepo.spec.testsuite.AbstractTest.confirmPresenceOfLinkValue(AbstractTest.java:557) at org.fcrepo.spec.testsuite.versioning.LdpcvHttpGet.ldpcvMustHaveTimeMapLinkHeader(LdpcvHttpGet.java:63) at org.fcrepo.spec.testsuite.App.main(App.java:309) ... Removed 27 stack frames
org.fcrepo.spec.testsuite.versioning.LdprvHttpGet
ldpvGetMustReturnOriginalResourceLink
java.lang.AssertionError: Link header with a value of <http://mementoweb.org/ns#OriginalResource>; rel="type" must be present but is not! expected [1] but found [0] at org.fcrepo.spec.testsuite.AbstractTest.confirmPresenceOfLinkValue(AbstractTest.java:561) at org.fcrepo.spec.testsuite.AbstractTest.confirmPresenceOfLinkValue(AbstractTest.java:557) at org.fcrepo.spec.testsuite.versioning.LdprvHttpGet.ldpvGetMustReturnOriginalResourceLink(LdprvHttpGet.java:168) at org.fcrepo.spec.testsuite.App.main(App.java:309) ... Removed 27 stack frames
ldpvGetMustReturnTimeGateTypeLink
java.lang.AssertionError: Link header with a value of <http://mementoweb.org/ns#TimeGate>; rel="type" must be present but is not! expected [1] but found [0] at org.fcrepo.spec.testsuite.AbstractTest.confirmPresenceOfLinkValue(AbstractTest.java:561) at org.fcrepo.spec.testsuite.AbstractTest.confirmPresenceOfLinkValue(AbstractTest.java:557) at org.fcrepo.spec.testsuite.versioning.LdprvHttpGet.ldpvGetMustReturnTimeGateTypeLink(LdprvHttpGet.java:186) at org.fcrepo.spec.testsuite.App.main(App.java:309) ... Removed 27 stack frames
shouldReturn302WhenLdprmFromTimeGate
java.lang.AssertionError: expected [http://0.0.0.0:8080/testsuitecontainer09092019181007/3b65153f-7628-4836-b527-620b1da83f26?version=0] but found [http://0.0.0.0:8080/testsuitecontainer09092019181007/3b65153f-7628-4836-b527-620b1da83f26?version=1568067016] at org.fcrepo.spec.testsuite.versioning.LdprvHttpGet.shouldReturn302WhenLdprmFromTimeGate(LdprvHttpGet.java:114) at org.fcrepo.spec.testsuite.App.main(App.java:309) ... Removed 28 stack frames
org.fcrepo.spec.testsuite.authz.WebACAccessToClass
accessToClassMustGiveAccessToBinary
java.lang.AssertionError: 1 expectation failed. Expected status code <403> but was <200>. at org.codehaus.groovy.runtime.callsite.ConstructorSite$ConstructorSiteNoUnwrap.callConstructor(ConstructorSite.java:84) at org.codehaus.groovy.runtime.callsite.AbstractCallSite.callConstructor(AbstractCallSite.java:247) at io.restassured.internal.ResponseSpecificationImpl$HamcrestAssertionClosure.validate(ResponseSpecificationImpl.groovy:483) at io.restassured.internal.ResponseSpecificationImpl$HamcrestAssertionClosure$validate$1.call(Unknown Source) at io.restassured.internal.ResponseSpecificationImpl.validateResponseIfRequired(ResponseSpecificationImpl.groovy:655) at org.codehaus.groovy.runtime.callsite.PogoMetaMethodSite$PogoCachedMethodSiteNoUnwrapNoCoerce.invoke(PogoMetaMethodSite.java:210) at org.codehaus.groovy.runtime.callsite.PogoMetaMethodSite.callCurrent(PogoMetaMethodSite.java:59) at org.codehaus.groovy.runtime.callsite.AbstractCallSite.callCurrent(AbstractCallSite.java:166) at io.restassured.internal.ResponseSpecificationImpl.statusCode(ResponseSpecificationImpl.groovy:123) at io.restassured.specification.ResponseSpecification$statusCode$0.callCurrent(Unknown Source) at io.restassured.internal.ResponseSpecificationImpl.statusCode(ResponseSpecificationImpl.groovy:131) at io.restassured.internal.ValidatableResponseOptionsImpl.statusCode(ValidatableResponseOptionsImpl.java:119) at org.fcrepo.spec.testsuite.authz.WebACAccessToClass.accessToClassMustGiveAccessToBinary(WebACAccessToClass.java:84) at org.fcrepo.spec.testsuite.App.main(App.java:309) ... Removed 30 stack frames
accessToClassMustGiveAccessToContainer
java.lang.AssertionError: 1 expectation failed. Expected status code <403> but was <200>. at org.codehaus.groovy.runtime.callsite.ConstructorSite$ConstructorSiteNoUnwrap.callConstructor(ConstructorSite.java:84) at org.codehaus.groovy.runtime.callsite.AbstractCallSite.callConstructor(AbstractCallSite.java:247) at io.restassured.internal.ResponseSpecificationImpl$HamcrestAssertionClosure.validate(ResponseSpecificationImpl.groovy:483) at io.restassured.internal.ResponseSpecificationImpl$HamcrestAssertionClosure$validate$1.call(Unknown Source) at io.restassured.internal.ResponseSpecificationImpl.validateResponseIfRequired(ResponseSpecificationImpl.groovy:655) at org.codehaus.groovy.runtime.callsite.PogoMetaMethodSite$PogoCachedMethodSiteNoUnwrapNoCoerce.invoke(PogoMetaMethodSite.java:210) at org.codehaus.groovy.runtime.callsite.PogoMetaMethodSite.callCurrent(PogoMetaMethodSite.java:59) at org.codehaus.groovy.runtime.callsite.AbstractCallSite.callCurrent(AbstractCallSite.java:166) at io.restassured.internal.ResponseSpecificationImpl.statusCode(ResponseSpecificationImpl.groovy:123) at io.restassured.specification.ResponseSpecification$statusCode$0.callCurrent(Unknown Source) at io.restassured.internal.ResponseSpecificationImpl.statusCode(ResponseSpecificationImpl.groovy:131) at io.restassured.internal.ValidatableResponseOptionsImpl.statusCode(ValidatableResponseOptionsImpl.java:119) at org.fcrepo.spec.testsuite.authz.WebACAccessToClass.accessToClassMustGiveAccessToContainer(WebACAccessToClass.java:53) at org.fcrepo.spec.testsuite.App.main(App.java:309) ... Removed 30 stack frames
org.fcrepo.spec.testsuite.versioning.LdpcvHttpPost
ldpcvDoesNotSupportPost
java.lang.AssertionError: Response does not contain a link of rel type = http://www.w3.org/ns/ldp#constrainedBy at org.fcrepo.spec.testsuite.AbstractTest.confirmPresenceOfConstrainedByLink(AbstractTest.java:591) at org.fcrepo.spec.testsuite.versioning.LdpcvHttpPost.ldpcvDoesNotSupportPost(LdpcvHttpPost.java:298) at org.fcrepo.spec.testsuite.App.main(App.java:309) ... Removed 23 stack frames
postToldpcvOfLdpnrWithoutMementoDatetimeMustIgnoreBody
java.lang.AssertionError: 1 expectation failed. Expected status code <201> but was <405>. at org.codehaus.groovy.runtime.callsite.ConstructorSite$ConstructorSiteNoUnwrap.callConstructor(ConstructorSite.java:84) at org.codehaus.groovy.runtime.callsite.AbstractCallSite.callConstructor(AbstractCallSite.java:247) at io.restassured.internal.ResponseSpecificationImpl$HamcrestAssertionClosure.validate(ResponseSpecificationImpl.groovy:483) at io.restassured.internal.ResponseSpecificationImpl$HamcrestAssertionClosure$validate$1.call(Unknown Source) at io.restassured.internal.ResponseSpecificationImpl.validateResponseIfRequired(ResponseSpecificationImpl.groovy:655) at org.codehaus.groovy.runtime.callsite.PogoMetaMethodSite$PogoCachedMethodSiteNoUnwrapNoCoerce.invoke(PogoMetaMethodSite.java:210) at org.codehaus.groovy.runtime.callsite.PogoMetaMethodSite.callCurrent(PogoMetaMethodSite.java:59) at org.codehaus.groovy.runtime.callsite.AbstractCallSite.callCurrent(AbstractCallSite.java:166) at io.restassured.internal.ResponseSpecificationImpl.statusCode(ResponseSpecificationImpl.groovy:123) at io.restassured.specification.ResponseSpecification$statusCode$0.callCurrent(Unknown Source) at io.restassured.internal.ResponseSpecificationImpl.statusCode(ResponseSpecificationImpl.groovy:131) at io.restassured.internal.ValidatableResponseOptionsImpl.statusCode(ValidatableResponseOptionsImpl.java:119) at org.fcrepo.spec.testsuite.AbstractTest.doPost(AbstractTest.java:272) at org.fcrepo.spec.testsuite.AbstractTest.doPost(AbstractTest.java:285) at org.fcrepo.spec.testsuite.versioning.LdpcvHttpPost.postToldpcvOfLdpnrWithoutMementoDatetimeMustIgnoreBody(LdpcvHttpPost.java:198) at org.fcrepo.spec.testsuite.App.main(App.java:309) ... Removed 30 stack frames
postToldpcvOfLdprsWithoutMementoDatetimeMustIgnoreBody
java.lang.AssertionError: 1 expectation failed. Expected status code <201> but was <405>. at org.codehaus.groovy.runtime.callsite.ConstructorSite$ConstructorSiteNoUnwrap.callConstructor(ConstructorSite.java:84) at org.codehaus.groovy.runtime.callsite.AbstractCallSite.callConstructor(AbstractCallSite.java:247) at io.restassured.internal.ResponseSpecificationImpl$HamcrestAssertionClosure.validate(ResponseSpecificationImpl.groovy:483) at io.restassured.internal.ResponseSpecificationImpl$HamcrestAssertionClosure$validate$1.call(Unknown Source) at io.restassured.internal.ResponseSpecificationImpl.validateResponseIfRequired(ResponseSpecificationImpl.groovy:655) at org.codehaus.groovy.runtime.callsite.PogoMetaMethodSite$PogoCachedMethodSiteNoUnwrapNoCoerce.invoke(PogoMetaMethodSite.java:210) at org.codehaus.groovy.runtime.callsite.PogoMetaMethodSite.callCurrent(PogoMetaMethodSite.java:59) at org.codehaus.groovy.runtime.callsite.AbstractCallSite.callCurrent(AbstractCallSite.java:166) at io.restassured.internal.ResponseSpecificationImpl.statusCode(ResponseSpecificationImpl.groovy:123) at io.restassured.specification.ResponseSpecification$statusCode$0.callCurrent(Unknown Source) at io.restassured.internal.ResponseSpecificationImpl.statusCode(ResponseSpecificationImpl.groovy:131) at io.restassured.internal.ValidatableResponseOptionsImpl.statusCode(ValidatableResponseOptionsImpl.java:119) at org.fcrepo.spec.testsuite.AbstractTest.doPost(AbstractTest.java:272) at org.fcrepo.spec.testsuite.AbstractTest.doPost(AbstractTest.java:285) at org.fcrepo.spec.testsuite.versioning.LdpcvHttpPost.postToldpcvOfLdprsWithoutMementoDatetimeMustIgnoreBody(LdpcvHttpPost.java:164) at org.fcrepo.spec.testsuite.App.main(App.java:309) ... Removed 30 stack frames
org.fcrepo.spec.testsuite.authz.WebACLinking
conflictIfNotSupportingAclLink
java.lang.AssertionError: Response does not contain a link of rel type = http://www.w3.org/ns/ldp#constrainedBy at org.fcrepo.spec.testsuite.AbstractTest.confirmPresenceOfConstrainedByLink(AbstractTest.java:591) at org.fcrepo.spec.testsuite.authz.WebACLinking.conflictIfNotSupportingAclLink(WebACLinking.java:92) at org.fcrepo.spec.testsuite.App.main(App.java:309) ... Removed 23 stack frames
org.fcrepo.spec.testsuite.authz.WebACCrossDomain
rejectRemoteAclConstraint
org.testng.SkipException: Client specified ACL locations not supported. at org.fcrepo.spec.testsuite.authz.WebACCrossDomain.createResourceWithRemoteAcl(WebACCrossDomain.java:58) at org.fcrepo.spec.testsuite.authz.WebACCrossDomain.rejectRemoteAclConstraint(WebACCrossDomain.java:98) at org.fcrepo.spec.testsuite.App.main(App.java:309) ... Removed 22 stack frames
rejectRemoteGroupConstraint
org.testng.SkipException: Implementation does not reject requests concerning remote Group Listings. at org.fcrepo.spec.testsuite.authz.WebACCrossDomain.rejectRemoteGroupConstraint(WebACCrossDomain.java:179) at org.fcrepo.spec.testsuite.App.main(App.java:309) ... Removed 22 stack frames
rejectRemoteGroupStatus
org.testng.SkipException: Implementation does not reject requests concerning remote Group Listings. at org.fcrepo.spec.testsuite.authz.WebACCrossDomain.rejectRemoteGroupStatus(WebACCrossDomain.java:157) at org.fcrepo.spec.testsuite.App.main(App.java:309) ... Removed 22 stack frames
org.fcrepo.spec.testsuite.versioning.LdprmHttpDelete
ldprmMustSupportDeleteIfAdvertised
org.testng.SkipException: DELETE not supported at org.fcrepo.spec.testsuite.versioning.LdprmHttpDelete.ldprmMustSupportDeleteIfAdvertised(LdprmHttpDelete.java:57) at org.fcrepo.spec.testsuite.App.main(App.java:309) ... Removed 22 stack frames
org.fcrepo.spec.testsuite.crud.ExternalBinaryContent
binaryContentGuaranteeHeaders
org.testng.SkipException: External Binaries are NOT supported at org.fcrepo.spec.testsuite.crud.ExternalBinaryContent.binaryContentGuaranteeHeaders(ExternalBinaryContent.java:781) at org.fcrepo.spec.testsuite.App.main(App.java:309) ... Removed 22 stack frames
binaryContentMediaType
org.testng.SkipException: External Binaries are NOT supported at org.fcrepo.spec.testsuite.crud.ExternalBinaryContent.binaryContentMediaType(ExternalBinaryContent.java:631) at org.fcrepo.spec.testsuite.App.main(App.java:309) ... Removed 22 stack frames
binaryContentOptions
org.testng.SkipException: External Binaries are NOT supported at org.fcrepo.spec.testsuite.crud.ExternalBinaryContent.binaryContentOptions(ExternalBinaryContent.java:809) at org.fcrepo.spec.testsuite.App.main(App.java:309) ... Removed 22 stack frames
binaryContentProxyWantDigest
org.testng.SkipException: External Binaries are NOT supported at org.fcrepo.spec.testsuite.crud.ExternalBinaryContent.binaryContentProxyWantDigest(ExternalBinaryContent.java:852) at org.fcrepo.spec.testsuite.App.main(App.java:309) ... Removed 22 stack frames
binaryContentRedirectStatusGet
org.testng.SkipException: External Binaries are NOT supported at org.fcrepo.spec.testsuite.crud.ExternalBinaryContent.binaryContentRedirectStatusGet(ExternalBinaryContent.java:877) at org.fcrepo.spec.testsuite.App.main(App.java:309) ... Removed 22 stack frames
binaryContentRedirectStatusHead
org.testng.SkipException: External Binaries are NOT supported at org.fcrepo.spec.testsuite.crud.ExternalBinaryContent.binaryContentRedirectStatusHead(ExternalBinaryContent.java:900) at org.fcrepo.spec.testsuite.App.main(App.java:309) ... Removed 22 stack frames
binaryContentRedirectWantDigest
org.testng.SkipException: External Binaries are NOT supported at org.fcrepo.spec.testsuite.crud.ExternalBinaryContent.binaryContentRedirectWantDigest(ExternalBinaryContent.java:827) at org.fcrepo.spec.testsuite.App.main(App.java:309) ... Removed 22 stack frames
externalBinaryContentHandlingAttribute
org.testng.SkipException: External Binaries are NOT supported at org.fcrepo.spec.testsuite.crud.ExternalBinaryContent.externalBinaryContentHandlingAttribute(ExternalBinaryContent.java:551) at org.fcrepo.spec.testsuite.App.main(App.java:309) ... Removed 22 stack frames
externalBinaryContentHandlingStatus
org.testng.SkipException: External Binaries are NOT supported at org.fcrepo.spec.testsuite.crud.ExternalBinaryContent.externalBinaryContentHandlingStatus(ExternalBinaryContent.java:584) at org.fcrepo.spec.testsuite.App.main(App.java:309) ... Removed 22 stack frames
unsupportedBinaryContentHandlingAttribute
org.testng.SkipException: External Binaries are NOT supported at org.fcrepo.spec.testsuite.crud.ExternalBinaryContent.unsupportedBinaryContentHandlingAttribute(ExternalBinaryContent.java:608) at org.fcrepo.spec.testsuite.App.main(App.java:309) ... Removed 22 stack frames
org.fcrepo.spec.testsuite.crud.StateToken
badStateTokenOnPatchWhenStateTokensSupported
org.testng.SkipException: This implementation does not support X-State-Token at org.fcrepo.spec.testsuite.crud.StateToken.skipIfStateTokenNotSupported(StateToken.java:68) at org.fcrepo.spec.testsuite.crud.StateToken.badStateTokenOnPatchWhenStateTokensSupported(StateToken.java:172) at org.fcrepo.spec.testsuite.App.main(App.java:309) ... Removed 22 stack frames
badStateTokenOnPutWhenStateTokensSupported
org.testng.SkipException: This implementation does not support X-State-Token at org.fcrepo.spec.testsuite.crud.StateToken.skipIfStateTokenNotSupported(StateToken.java:68) at org.fcrepo.spec.testsuite.crud.StateToken.badStateTokenOnPutWhenStateTokensSupported(StateToken.java:252) at org.fcrepo.spec.testsuite.App.main(App.java:309) ... Removed 22 stack frames
goodStateTokenOnPatchWhenStateTokensSupported
org.testng.SkipException: This implementation does not support X-State-Token at org.fcrepo.spec.testsuite.crud.StateToken.skipIfStateTokenNotSupported(StateToken.java:68) at org.fcrepo.spec.testsuite.crud.StateToken.goodStateTokenOnPatchWhenStateTokensSupported(StateToken.java:119) at org.fcrepo.spec.testsuite.App.main(App.java:309) ... Removed 22 stack frames
goodStateTokenOnPutSucceedsWhenStateTokensSupported
org.testng.SkipException: This implementation does not support X-State-Token at org.fcrepo.spec.testsuite.crud.StateToken.skipIfStateTokenNotSupported(StateToken.java:68) at org.fcrepo.spec.testsuite.crud.StateToken.goodStateTokenOnPutSucceedsWhenStateTokensSupported(StateToken.java:199) at org.fcrepo.spec.testsuite.App.main(App.java:309) ... Removed 22 stack frames
org.fcrepo.spec.testsuite.versioning.LdprmHttpOptions
ldprmMustNotSupportPatch
ldprmMustNotSupportPost
ldprmMustNotSupportPut
ldprmMustSupportOptions
ldprmOptionsMustSupportGetHeadAndOptions
org.fcrepo.spec.testsuite.crud.HttpHead
httpHeadResponseDigest
httpHeadResponseNoBody
org.fcrepo.spec.testsuite.authz.WebACRdfSources
aclIsLDPRS
org.fcrepo.spec.testsuite.crud.Container
createLDPC
ldpDirectContainerMustAllowHasMemberRelationPredicateToBeSetOnCreate
ldpDirectContainerMustAllowIsMemberOfRelationPredicateToBeSetOnCreate
ldpDirectContainerMustAllowMembershipConstantURIToBeSet
ldpDirectContainerSupportOrConstraintsDocument
ldpIndirectContainerMustAllowHasMemberRelationPredicateToBeSetOnCreate
ldpIndirectContainerMustAllowInsertedContentRelationPredicateToBeSetOnCreate
ldpIndirectContainerMustAllowIsMemberOfRelationPredicateToBeSetOnCreate
ldpIndirectContainerMustAllowMembershipConstantURIToBeSet
ldpIndirectContainerSupportOrConstraintsDocument
ldpcContainmentTriples
ldpcMembershipTriples
ldpcMinimalContainerTriples
org.fcrepo.spec.testsuite.versioning.LdpcvHttpOptions
ldpcvMustReturnAcceptPatchHeaderIfPatchIsSupported
ldpcvMustReturnAcceptPostHeaderIfPostIsSupported
ldpcvMustSupportOptions
ldpcvOptionsMustAllowHeadGetOptions
org.fcrepo.spec.testsuite.authz.WebACLinkHeaders
linkToAclExisting
linkToAclNonexisting
org.fcrepo.spec.testsuite.crud.HttpPost
httpPost
postNonRDFSource
postResourceAndCheckAssociatedResource
org.fcrepo.spec.testsuite.crud.HttpOptions
httpOptionsSupport
httpOptionsSupportAllow
org.fcrepo.spec.testsuite.authz.WebACRepresentation
accessDenied
aclExamined
aclRepresentation
dereferencingGroups
org.fcrepo.spec.testsuite.authz.WebACGeneral
agentAll
agentDouble
agentGroup
agentGroupWithHashUris
agentSingle
allAuthenticatedAgents
org.fcrepo.spec.testsuite.crud.HttpPatch
disallowPatchContainmentTriples
serverManagedPropertiesModification
statementNotPersistedResponseBody
successfulPatchStatusCode
supportPatch
org.fcrepo.spec.testsuite.crud.HttpDelete
httpDeleteStatusCheck
httpDeleteStatusCheckTwo
org.fcrepo.spec.testsuite.authz.WebACModes
appendAllowedPOST
appendDisallowed
appendNotWriteLdpCMust
appendNotWriteLdpNr
appendNotWriteLdpRsMust
controlAllowedGET
controlAllowedPATCH
controlAllowedPUT
controlDisallowedGET
controlDisallowedPATCH
controlDisallowedPUT
readAllowedGET
readAllowedHEAD
readDisallowed
writeAllowedDELETE
writeAllowedPATCH
writeAllowedPOST
writeAllowedPUT
writeDisallowedDelete
writeDisallowedPatch
writeDisallowedPost
writeDisallowedPut
org.fcrepo.spec.testsuite.crud.HttpGet
responseDescribesHeader
responsePreferenceAppliedHeader
org.fcrepo.spec.testsuite.crud.HttpPut
httpPutNR
httpPutUpdateTriples
putNonRDFSourceCreateLDPRS
org.fcrepo.spec.testsuite.authz.WebACDefaultACLs
aclInheritanceMustUseLdpContainmentRelationships
org.fcrepo.spec.testsuite.versioning.LdprmHttpGet
ldpnrmMustHaveCorrectTimeGate
ldpnrmMustSupportGet
ldprmMustHaveCorrectTimeGate
ldprmMustSupportGet
org.fcrepo.spec.testsuite.versioning.LdpcvHttpGet
ldpcvMustIncludeAcceptPatchIfPatchAllowed
ldpcvMustIncludeAcceptPostIfPostAllowed
ldpcvMustRespondToGetWithApplicationLinkAcceptHeader
ldpcvMustSupportGet
lpcvMustIncludeAllowHeader
org.fcrepo.spec.testsuite.versioning.LdprvHttpGet
ldpvGetMustReturnHeaderOriginalTypeLink
ldpvGetMustReturnHeaderTimeGateTypeLink
ldpvGetMustReturnTimeMapLink
ldpvGetMustReturnVaryHeader
org.fcrepo.spec.testsuite.event.NotificationTest
testCatchMessage
testEventSerialization
Default testng.xml
<?xml version="1.0" encoding="UTF-8"?>
<!DOCTYPE suite SYSTEM "http://testng.org/testng-1.0.dtd">
<suite guice-stage="DEVELOPMENT" name="Fedora API Specification Test Suite">
  <listeners>
    <listener class-name="org.fcrepo.spec.testsuite.report.HtmlReporter"/>
    <listener class-name="org.fcrepo.spec.testsuite.report.EarlReporter"/>
  </listeners>
  <test name="Fedora API Specification Tests">
    <groups>
      <define name="all">
        <include name="MUST"/>
        <include name="SHOULD"/>
        <include name="MAY"/>
        <include name="MUST NOT"/>
        <include name="SHOULD NOT"/>
      </define> <!-- all -->
      <define name="mustnot">
        <include name="MUST NOT"/>
      </define> <!-- mustnot -->
      <define name="shouldnot">
        <include name="SHOULD NOT"/>
      </define> <!-- shouldnot -->
      <define name="may">
        <include name="MAY"/>
      </define> <!-- may -->
      <define name="should">
        <include name="SHOULD"/>
      </define> <!-- should -->
      <define name="must">
        <include name="MUST"/>
      </define> <!-- must -->
      <run>
        <include name="must"/>
      </run>
    </groups>
    <classes>
      <class name="org.fcrepo.spec.testsuite.crud.Container"/>
      <class name="org.fcrepo.spec.testsuite.crud.Ldpnr"/>
      <class name="org.fcrepo.spec.testsuite.crud.HttpGet"/>
      <class name="org.fcrepo.spec.testsuite.crud.HttpHead"/>
      <class name="org.fcrepo.spec.testsuite.crud.HttpOptions"/>
      <class name="org.fcrepo.spec.testsuite.crud.HttpPost"/>
      <class name="org.fcrepo.spec.testsuite.crud.HttpPut"/>
      <class name="org.fcrepo.spec.testsuite.crud.HttpPatch"/>
      <class name="org.fcrepo.spec.testsuite.crud.HttpDelete"/>
      <class name="org.fcrepo.spec.testsuite.crud.ExternalBinaryContent"/>
      <class name="org.fcrepo.spec.testsuite.crud.StateToken"/>
      <class name="org.fcrepo.spec.testsuite.versioning.LdprvHttpGet"/>
      <class name="org.fcrepo.spec.testsuite.versioning.LdprvHttpPut"/>
      <class name="org.fcrepo.spec.testsuite.versioning.LdprmHttpGet"/>
      <class name="org.fcrepo.spec.testsuite.versioning.LdprmHttpDelete"/>
      <class name="org.fcrepo.spec.testsuite.versioning.LdprmHttpOptions"/>
      <class name="org.fcrepo.spec.testsuite.versioning.LdpcvHttpGet"/>
      <class name="org.fcrepo.spec.testsuite.versioning.LdpcvHttpPost"/>
      <class name="org.fcrepo.spec.testsuite.versioning.LdpcvHttpDelete"/>
      <class name="org.fcrepo.spec.testsuite.versioning.LdpcvHttpOptions"/>
      <class name="org.fcrepo.spec.testsuite.versioning.ResourceVersioning"/>
      <class name="org.fcrepo.spec.testsuite.authz.WebACLinking"/>
      <class name="org.fcrepo.spec.testsuite.authz.WebACModes"/>
      <class name="org.fcrepo.spec.testsuite.authz.WebACLinkHeaders"/>
      <class name="org.fcrepo.spec.testsuite.authz.WebACRepresentation"/>
      <class name="org.fcrepo.spec.testsuite.authz.WebACRdfSources"/>
      <class name="org.fcrepo.spec.testsuite.authz.WebACGeneral"/>
      <class name="org.fcrepo.spec.testsuite.authz.WebACDefaultACLs"/>
      <class name="org.fcrepo.spec.testsuite.authz.WebACAccessToClass"/>
      <class name="org.fcrepo.spec.testsuite.authz.WebACCrossDomain"/>
      <class name="org.fcrepo.spec.testsuite.event.NotificationTest"/>
    </classes>
  </test> <!-- Fedora API Specification Tests -->
</suite> <!-- Fedora API Specification Test Suite -->
            
Tests for Fedora API Specification Test Suite
  • Fedora API Specification Tests (31 classes)
Groups for Fedora API Specification Test Suite
MUST
accessDenied
accessToClassMustGiveAccessToBinary
accessToClassMustGiveAccessToContainer
aclExamined
aclInheritanceMustUseLdpContainmentRelationships
aclIsLDPRS
aclRepresentation
agentAll
agentDouble
agentGroup
agentGroupWithHashUris
agentSingle
allAuthenticatedAgents
appendAllowedPATCH
appendAllowedPOST
appendDisallowed
appendNotWriteLdpCMust
appendNotWriteLdpNr
appendNotWriteLdpRsMust
appendNotWritePutToCreate
badStateTokenOnPatchWhenStateTokensSupported
badStateTokenOnPutWhenStateTokensSupported
binaryContentGuaranteeHeaders
binaryContentMediaType
binaryContentOptions
binaryContentProxyWantDigest
binaryContentRedirectStatusGet
binaryContentRedirectStatusHead
binaryContentRedirectWantDigest
conflictIfNotSupportingAclLink
controlAllowedGET
controlAllowedPATCH
controlAllowedPUT
controlDisallowedGET
controlDisallowedPATCH
controlDisallowedPUT
createLDPC
dereferencingGroups
disallowChangeResourceType
disallowPatchContainmentTriples
externalBinaryContentHandlingAttribute
externalBinaryContentHandlingStatus
goodStateTokenOnPatchWhenStateTokensSupported
goodStateTokenOnPutSucceedsWhenStateTokensSupported
httpDeleteStatusCheck
httpDeleteStatusCheckTwo
httpHeadResponseDigest
httpHeadResponseNoBody
httpOptionsSupport
httpOptionsSupportAllow
httpPost
httpPutNR
httpPutUpdateDisallowedTriples
httpPutUpdateDisallowedTriplesConstrainedByHeader
httpPutUpdateDisallowedTriplesResponse
httpPutUpdateTriples
ldpDirectContainerMustAllowHasMemberRelationPredicateToBeSetOnCreate
ldpDirectContainerMustAllowIsMemberOfRelationPredicateToBeSetOnCreate
ldpDirectContainerMustAllowMembershipConstantURIToBeSet
ldpDirectContainerMustAllowMembershipPredicateToBeSetByDefault
ldpDirectContainerMustSetLdpMembershipResourceByDefault
ldpDirectContainerSupportOrConstraintsDocument
ldpIndirectContainerMustAllowHasMemberRelationPredicateToBeSetOnCreate
ldpIndirectContainerMustAllowInsertedContentRelationPredicateToBeSetOnCreate
ldpIndirectContainerMustAllowInsertedContentRelationToBeSetByDefault
ldpIndirectContainerMustAllowIsMemberOfRelationPredicateToBeSetOnCreate
ldpIndirectContainerMustAllowMembershipConstantURIToBeSet
ldpIndirectContainerMustAllowMembershipPredicateToBeSetByDefault
ldpIndirectContainerMustSetLdpMembershipResourceByDefault
ldpIndirectContainerSupportOrConstraintsDocument
ldpcContainmentTriples
ldpcMembershipTriples
ldpcMinimalContainerTriples
ldpcvDoesNotSupportPost
ldpcvMustHaveContainerLinkHeader
ldpcvMustHaveTimeMapLinkHeader
ldpcvMustIncludeAcceptPatchIfPatchAllowed
ldpcvMustIncludeAcceptPostIfPostAllowed
ldpcvMustRespondToGetWithApplicationLinkAcceptHeader
ldpcvMustReturnAcceptPatchHeaderIfPatchIsSupported
ldpcvMustReturnAcceptPostHeaderIfPostIsSupported
ldpcvMustSupportGet
ldpcvMustSupportOptions
ldpcvOptionsMustAllowHeadGetOptions
ldpnrmMustHaveCorrectTimeGate
ldpnrmMustHaveMementoLinkHeader
ldpnrmMustSupportGet
ldpnrvMustSupportPUT
ldpnrvMustSupportPUTForExistingResources
ldprmMustHaveCorrectTimeGate
ldprmMustHaveMementoLinkHeader
ldprmMustNotSupportPatch
ldprmMustNotSupportPost
ldprmMustNotSupportPut
ldprmMustSupportDeleteIfAdvertised
ldprmMustSupportGet
ldprmMustSupportOptions
ldprmOptionsMustSupportGetHeadAndOptions
ldprvMustSupportPUT
ldprvMustSupportPUTForExistingResources
ldpvGetMustReturnHeaderOriginalTypeLink
ldpvGetMustReturnHeaderTimeGateTypeLink
ldpvGetMustReturnOriginalResourceLink
ldpvGetMustReturnTimeGateTypeLink
ldpvGetMustReturnTimeMapLink
ldpvGetMustReturnVaryHeader
linkToAclExisting
linkToAclNonexisting
lpcvMustIncludeAllowHeader
nonRDFSourcePutDigestResponseHeaderAuthentication
onlyAuthorizationStatementsUsed
postDigestResponseHeaderAuthentication
postLdprWithType
postNonRDFSource
postResourceAndCheckAssociatedResource
postToldpcvOfLdpnrWithoutMementoDatetimeMustIgnoreBody
postToldpcvOfLdprsWithoutMementoDatetimeMustIgnoreBody
putNonRDFSourceCreateLDPRS
readAllowedGET
readAllowedHEAD
readDisallowed
rejectRemoteAclConstraint
rejectRemoteAclStatus
rejectRemoteGroupConstraint
rejectRemoteGroupStatus
resourceSingle
respondWantDigestMd5
respondWantDigestNonSupported
respondWantDigestNonSupportedWithSupported
respondWantDigestSha1
respondWantDigestSha256
respondWantDigestTwoSupported
respondWantDigestTwoSupportedQvalueNonZero
respondWantDigestTwoSupportedQvalueZero
responseDescribesHeader
responsePreferenceAppliedHeader
serverManagedPropertiesModification
shouldReturn302WhenLdprmFromTimeGate
statementNotPersistedConstrainedBy
statementNotPersistedResponseBody
successfulPatchStatusCode
supportPatch
testCatchMessage
testEventSerialization
unsupportedBinaryContentHandlingAttribute
unsupportedExternalBinaryContentConstraint
unsupportedExternalBinaryContentStatus
writeAllowedDELETE
writeAllowedPATCH
writeAllowedPOST
writeAllowedPUT
writeDisallowedDelete
writeDisallowedPatch
writeDisallowedPost
writeDisallowedPut
Times for Fedora API Specification Test Suite
Total running time: 9 seconds
Reporter output for Fedora API Specification Test Suite
86 ignored methods
org.fcrepo.spec.testsuite.versioning.LdprvHttpPut
changeLDPRToAnLDPRv
org.fcrepo.spec.testsuite.versioning.LdprmHttpOptions
ldprmOptionsMaySupportDelete
org.fcrepo.spec.testsuite.crud.Container
ldpIndirectContainerShouldUseLdpMemberSubjectByDefault
ldpIndirectContainerMayAllowLdpMembershipToBeUpdatedByPatch
ldpIndirectContainerMayAllowLdpIsMemberRelationToBeUpdatedByPatch
ldpIndirectContainerMayAllowLdpInsertedContentRelationPredicateToBeUpdatedByPut
ldpIndirectContainerMayAllowLdpMembershipToBeUpdatedByPut
ldpIndirectContainerMustSetLdpMembershipResourceValueToLDPCByDefault
ldpDirectContainerMayAllowLdpIsMemberRelationPredicateToBeUpdatedByPut
createLDPDirectContainer
ldpDirectContainerMayAllowLdpHasMemberRelationPredicateToBeUpdatedByPut
ldpDirectContainerMayAllowLdpMembershipToBeUpdatedByPatch
ldpIndirectContainerShouldUseLdpMemberByDefault
createLDPIndirectContainer
ldpIndirectContainerMayAllowLdpIsMemberRelationPredicateToBeUpdatedByPut
ldpIndirectContainerMayAllowLdpHasMemberRelationToBeUpdatedByPatch
ldpIndirectContainerMayAllowLdpInsertedContentRelationToBeUpdatedByPatch
ldpDirectContainerMayAllowLdpHasMemberRelationToBeUpdatedByPatch
ldpDirectContainerMustSetLdpMembershipResourceValueToLDPCByDefault
ldpDirectContainerShouldUseLdpMemberByDefault
ldpDirectContainerMayAllowLdpMembershipToBeUpdatedByPut
ldpIndirectContainerMayAllowLdpHasMemberRelationPredicateToBeUpdatedByPut
ldpDirectContainerMayAllowLdpIsMemberRelationToBeUpdatedByPatch
org.fcrepo.spec.testsuite.authz.WebACLinkHeaders
aclOnSameServer
org.fcrepo.spec.testsuite.crud.HttpPatch
ldpPatchContentTypeSupport
org.fcrepo.spec.testsuite.authz.WebACCrossDomain
restrictAclToLocal
restrictGroupToLocal
org.fcrepo.spec.testsuite.versioning.LdpcvHttpDelete
ldpcvThatAdvertisesDeleteShouldRemoveContainerAndMementos
ldpcvMaySupportDelete
org.fcrepo.spec.testsuite.crud.StateToken
stateTokenHead
badStateTokenOnPutWhenStateTokensIgnored
stateTokenGet
badStateTokenOnPatchWhenStateTokensIgnored
org.fcrepo.spec.testsuite.versioning.LdpcvHttpPost
ldpcvMayDisallowPatch
ldpcvOfLdprsShouldSupportPostWithoutMementoDatetimeHeader
ldpcvMayDisallowPut
ldpcvOfLdpnrsShouldSupportPostWithoutMementoDatetimeHeader
mementoDatetimeHeaderShouldMatchThatUsedWhenMementoCreated
postToldpcvOfLdprWithMementoDatetimeShouldCreateNewResource
ldpcvMayDisallowPost
org.fcrepo.spec.testsuite.crud.HttpHead
httpHeadResponseHeadersSameAsHttpGet
org.fcrepo.spec.testsuite.versioning.LdpcvHttpOptions
ldpcvMaySupportDeleteOption
ldpcvMaySupportPatch
ldpcvMaySupportPost
org.fcrepo.spec.testsuite.crud.HttpPost
postDigestResponseHeaderVerification
org.fcrepo.spec.testsuite.versioning.ResourceVersioning
convertToLDPRViaPutWithType
org.fcrepo.spec.testsuite.crud.HttpDelete
httpDeleteOptionsCheck
org.fcrepo.spec.testsuite.crud.HttpGet
additionalValuesForPreferHeaderContainedDescriptions
additionalValuesForPreferHeader
org.fcrepo.spec.testsuite.authz.WebACModes
appendNotWriteLdpRsShould
org.fcrepo.spec.testsuite.crud.HttpPut
httpPutChangeTypeNotAllowed
putCreateNonRDFSource
putCreateRDFSource
httpPutChangeTypeAllowed
nonRDFSourcePutDigestResponseHeaderVerification
org.fcrepo.spec.testsuite.authz.WebACDefaultACLs
serverSuppliedDefaultAcl
defaultAclOnSameServer
org.fcrepo.spec.testsuite.crud.ExternalBinaryContent
binaryContentNoTypeExternalType
postCreateExternalFileUriBinaryRedirect
putCreateExternalFileUriBinaryProxy
postCreateExternalBinaryContentCopy
putCreateExternalBinaryContentRedirect
putCreateExternalBinaryContentCopy
putCreateExternalFileUriBinaryCopy
putCreateExternalBinaryContentProxy
postCreateExternalFileUriBinaryProxy
putCreateExternalFileUriBinaryRedirect
postCreateExternalBinaryContentRedirect
putUpdateExternalBinaryContentRedirect
binaryContentContentTypeAndNoType
binaryContentNoTypeDefault
putUpdateExternalFileUriBinaryCopy
putUpdateExternalFileUriBinaryRedirect
postCreateExternalBinaryContentProxy
binaryContentContentTypeAndType
binaryContentNoTypeUnsupported
putUpdateExternalBinaryContentProxy
putUpdateExternalBinaryContentCopy
putUpdateExternalFileUriBinaryProxy
postCreateExternalFileUriBinaryCopy
org.fcrepo.spec.testsuite.crud.Ldpnr
ldpnrCreationLinkType
ldpnrCreationWrongLinkType
org.fcrepo.spec.testsuite.versioning.LdprvHttpGet
shouldReturn406WhenNoLdprm
org.fcrepo.spec.testsuite.event.NotificationTest
testEventSerializationShould
org.fcrepo.spec.testsuite.authz.WebACAccessToClass
accessToClassMayUseInference
org.fcrepo.spec.testsuite.authz.WebACLinking
linkToAclOnCreation
Methods in chronological order
org.fcrepo.spec.testsuite.crud.Container
setup 0 ms
createLDPC 3 ms
tearDown 108 ms
ldpDirectContainerMustAllowHasMemberRelationPredicateToBeSetOnCreate 109 ms
setup 109 ms
ldpDirectContainerMustAllowIsMemberOfRelationPredicateToBeSetOnCreate 313 ms
setup 313 ms
tearDown 313 ms
setup 383 ms
tearDown 383 ms
ldpDirectContainerMustAllowMembershipConstantURIToBeSet 384 ms
ldpDirectContainerMustAllowMembershipPredicateToBeSetByDefault 455 ms
setup 455 ms
tearDown 455 ms
ldpDirectContainerMustSetLdpMembershipResourceByDefault 472 ms
setup 472 ms
tearDown 472 ms
tearDown 484 ms
ldpDirectContainerSupportOrConstraintsDocument 485 ms
ldpIndirectContainerMustAllowHasMemberRelationPredicateToBeSetOnCreate 485 ms
setup 485 ms
setup 485 ms
tearDown 485 ms
tearDown 605 ms
ldpIndirectContainerMustAllowInsertedContentRelationPredicateToBeSetOnCreate 606 ms
setup 606 ms
ldpIndirectContainerMustAllowInsertedContentRelationToBeSetByDefault 672 ms
setup 672 ms
tearDown 672 ms
ldpIndirectContainerMustAllowIsMemberOfRelationPredicateToBeSetOnCreate 683 ms
setup 683 ms
tearDown 683 ms
tearDown 726 ms
ldpIndirectContainerMustAllowMembershipConstantURIToBeSet 727 ms
setup 727 ms
tearDown 772 ms
ldpIndirectContainerMustAllowMembershipPredicateToBeSetByDefault 773 ms
setup 773 ms
tearDown 784 ms
ldpIndirectContainerMustSetLdpMembershipResourceByDefault 785 ms
setup 785 ms
tearDown 796 ms
ldpIndirectContainerSupportOrConstraintsDocument 797 ms
setup 797 ms
setup 797 ms
tearDown 797 ms
ldpcContainmentTriples 798 ms
setup 959 ms
tearDown 959 ms
ldpcMembershipTriples 960 ms
tearDown 1163 ms
ldpcMinimalContainerTriples 1164 ms
setup 1164 ms
tearDown 1333 ms
org.fcrepo.spec.testsuite.crud.HttpGet
respondWantDigestMd5 1334 ms
setup 1334 ms
setup 1378 ms
tearDown 1378 ms
respondWantDigestNonSupported 1379 ms
respondWantDigestNonSupportedWithSupported 1415 ms
setup 1415 ms
tearDown 1415 ms
respondWantDigestSha1 1448 ms
setup 1448 ms
tearDown 1448 ms
setup 1480 ms
tearDown 1480 ms
respondWantDigestSha256 1481 ms
tearDown 1513 ms
respondWantDigestTwoSupported 1514 ms
setup 1514 ms
respondWantDigestTwoSupportedQvalueNonZero 1547 ms
setup 1547 ms
tearDown 1547 ms
tearDown 1581 ms
respondWantDigestTwoSupportedQvalueZero 1582 ms
setup 1582 ms
tearDown 1615 ms
responseDescribesHeader 1616 ms
setup 1616 ms
tearDown 1673 ms
responsePreferenceAppliedHeader 1674 ms
setup 1674 ms
org.fcrepo.spec.testsuite.versioning.LdpcvHttpOptions
ldpcvMustReturnAcceptPatchHeaderIfPatchIsSupported 1710 ms
setup 1710 ms
org.fcrepo.spec.testsuite.crud.HttpGet
tearDown 1710 ms
org.fcrepo.spec.testsuite.versioning.LdpcvHttpOptions
setup 1754 ms
tearDown 1754 ms
ldpcvMustReturnAcceptPostHeaderIfPostIsSupported 1755 ms
ldpcvMustSupportOptions 1818 ms
setup 1818 ms
tearDown 1818 ms
tearDown 1866 ms
ldpcvOptionsMustAllowHeadGetOptions 1867 ms
setup 1867 ms
tearDown 1911 ms
org.fcrepo.spec.testsuite.crud.HttpHead
httpHeadResponseDigest 1914 ms
setup 1914 ms
setup 1956 ms
tearDown 1956 ms
httpHeadResponseNoBody 1957 ms
org.fcrepo.spec.testsuite.versioning.ResourceVersioning
postLdprWithType 2047 ms
setup 2047 ms
org.fcrepo.spec.testsuite.crud.HttpHead
tearDown 2047 ms
org.fcrepo.spec.testsuite.versioning.ResourceVersioning
tearDown 2078 ms
org.fcrepo.spec.testsuite.crud.HttpOptions
httpOptionsSupport 2079 ms
setup 2079 ms
tearDown 2085 ms
httpOptionsSupportAllow 2086 ms
setup 2086 ms
org.fcrepo.spec.testsuite.authz.WebACLinking
conflictIfNotSupportingAclLink 2093 ms
setup 2093 ms
org.fcrepo.spec.testsuite.crud.HttpOptions
tearDown 2093 ms
org.fcrepo.spec.testsuite.authz.WebACLinking
tearDown 2130 ms
org.fcrepo.spec.testsuite.crud.HttpPost
httpPost 2131 ms
setup 2131 ms
postDigestResponseHeaderAuthentication 2156 ms
setup 2156 ms
tearDown 2156 ms
postNonRDFSource 2180 ms
setup 2180 ms
tearDown 2180 ms
setup 2203 ms
tearDown 2203 ms
postResourceAndCheckAssociatedResource 2204 ms
org.fcrepo.spec.testsuite.authz.WebACModes
appendAllowedPATCH 2228 ms
setup 2228 ms
org.fcrepo.spec.testsuite.crud.HttpPost
tearDown 2228 ms
org.fcrepo.spec.testsuite.authz.WebACModes
tearDown 2289 ms
appendAllowedPOST 2290 ms
setup 2290 ms
setup 2368 ms
tearDown 2368 ms
appendDisallowed 2369 ms
tearDown 2422 ms
appendNotWriteLdpCMust 2423 ms
setup 2423 ms
tearDown 2508 ms
appendNotWriteLdpNr 2509 ms
setup 2509 ms
appendNotWriteLdpRsMust 2816 ms
setup 2816 ms
tearDown 2816 ms
appendNotWritePutToCreate 2900 ms
setup 2900 ms
tearDown 2900 ms
tearDown 2972 ms
controlAllowedGET 2973 ms
setup 2973 ms
tearDown 3037 ms
controlAllowedPATCH 3038 ms
setup 3038 ms
setup 3110 ms
tearDown 3110 ms
controlAllowedPUT 3111 ms
controlDisallowedGET 3190 ms
setup 3190 ms
tearDown 3190 ms
controlDisallowedPATCH 3239 ms
setup 3239 ms
tearDown 3239 ms
controlDisallowedPUT 3288 ms
setup 3288 ms
tearDown 3288 ms
readAllowedGET 3368 ms
setup 3368 ms
tearDown 3368 ms
readAllowedHEAD 3422 ms
setup 3422 ms
tearDown 3422 ms
readDisallowed 3475 ms
setup 3475 ms
tearDown 3475 ms
setup 3529 ms
tearDown 3529 ms
writeAllowedDELETE 3529 ms
setup 3607 ms
tearDown 3607 ms
writeAllowedPATCH 3607 ms
tearDown 3671 ms
setup 3672 ms
writeAllowedPOST 3672 ms
setup 3738 ms
tearDown 3738 ms
writeAllowedPUT 3738 ms
setup 3804 ms
tearDown 3804 ms
writeDisallowedDelete 3804 ms
tearDown 3860 ms
setup 3861 ms
writeDisallowedPatch 3861 ms
tearDown 3909 ms
setup 3910 ms
writeDisallowedPost 3910 ms
setup 3967 ms
tearDown 3967 ms
writeDisallowedPut 3968 ms
tearDown 4023 ms
org.fcrepo.spec.testsuite.crud.HttpPut
httpPutNR 4025 ms
setup 4025 ms
tearDown 4067 ms
httpPutUpdateDisallowedTriples 4068 ms
setup 4068 ms
tearDown 4134 ms
httpPutUpdateDisallowedTriplesConstrainedByHeader 4135 ms
setup 4135 ms
httpPutUpdateDisallowedTriplesResponse 4209 ms
setup 4209 ms
tearDown 4209 ms
tearDown 4281 ms
httpPutUpdateTriples 4282 ms
setup 4282 ms
nonRDFSourcePutDigestResponseHeaderAuthentication 4331 ms
setup 4331 ms
tearDown 4331 ms
putNonRDFSourceCreateLDPRS 4371 ms
setup 4371 ms
tearDown 4371 ms
org.fcrepo.spec.testsuite.authz.WebACLinkHeaders
setup 4403 ms
org.fcrepo.spec.testsuite.crud.HttpPut
tearDown 4403 ms
org.fcrepo.spec.testsuite.authz.WebACLinkHeaders
linkToAclExisting 4404 ms
tearDown 4480 ms
linkToAclNonexisting 4481 ms
setup 4481 ms
org.fcrepo.spec.testsuite.crud.HttpPatch
disallowChangeResourceType 4520 ms
setup 4520 ms
org.fcrepo.spec.testsuite.authz.WebACLinkHeaders
tearDown 4520 ms
org.fcrepo.spec.testsuite.crud.HttpPatch
setup 4565 ms
tearDown 4565 ms
disallowPatchContainmentTriples 4566 ms
serverManagedPropertiesModification 4625 ms
setup 4625 ms
tearDown 4625 ms
setup 4654 ms
statementNotPersistedConstrainedBy 4654 ms
tearDown 4654 ms
setup 4779 ms
statementNotPersistedResponseBody 4779 ms
tearDown 4779 ms
setup 4817 ms
successfulPatchStatusCode 4817 ms
tearDown 4817 ms
tearDown 4856 ms
setup 4857 ms
supportPatch 4857 ms
tearDown 4919 ms
org.fcrepo.spec.testsuite.authz.WebACRepresentation
accessDenied 4920 ms
setup 4920 ms
aclExamined 4971 ms
setup 4971 ms
tearDown 4971 ms
setup 5050 ms
tearDown 5050 ms
aclRepresentation 5051 ms
dereferencingGroups 5134 ms
setup 5134 ms
tearDown 5134 ms
tearDown 5314 ms
onlyAuthorizationStatementsUsed 5315 ms
setup 5315 ms
org.fcrepo.spec.testsuite.crud.HttpDelete
httpDeleteStatusCheck 5434 ms
setup 5434 ms
org.fcrepo.spec.testsuite.authz.WebACRepresentation
tearDown 5434 ms
org.fcrepo.spec.testsuite.crud.HttpDelete
httpDeleteStatusCheckTwo 5590 ms
setup 5590 ms
tearDown 5590 ms
org.fcrepo.spec.testsuite.authz.WebACRdfSources
setup 5762 ms
org.fcrepo.spec.testsuite.crud.HttpDelete
tearDown 5762 ms
org.fcrepo.spec.testsuite.authz.WebACRdfSources
aclIsLDPRS 5763 ms
org.fcrepo.spec.testsuite.crud.ExternalBinaryContent
setup 5840 ms
org.fcrepo.spec.testsuite.authz.WebACRdfSources
tearDown 5840 ms
org.fcrepo.spec.testsuite.crud.ExternalBinaryContent
binaryContentGuaranteeHeaders 5841 ms
binaryContentMediaType 5849 ms
setup 5849 ms
setup 5849 ms
tearDown 5849 ms
tearDown 5849 ms
binaryContentOptions 5850 ms
binaryContentProxyWantDigest 5850 ms
setup 5850 ms
tearDown 5850 ms
tearDown 5850 ms
binaryContentRedirectStatusGet 5851 ms
binaryContentRedirectStatusHead 5851 ms
setup 5851 ms
setup 5851 ms
tearDown 5851 ms
tearDown 5851 ms
binaryContentRedirectWantDigest 5852 ms
externalBinaryContentHandlingAttribute 5852 ms
setup 5852 ms
setup 5852 ms
tearDown 5852 ms
externalBinaryContentHandlingStatus 5853 ms
setup 5853 ms
setup 5853 ms
tearDown 5853 ms
tearDown 5853 ms
unsupportedBinaryContentHandlingAttribute 5853 ms
setup 5854 ms
tearDown 5854 ms
unsupportedExternalBinaryContentConstraint 5854 ms
setup 5878 ms
tearDown 5878 ms
unsupportedExternalBinaryContentStatus 5879 ms
stopServer 5902 ms
tearDown 5902 ms
org.fcrepo.spec.testsuite.authz.WebACGeneral
agentAll 5906 ms
setup 5906 ms
setup 6005 ms
tearDown 6005 ms
agentDouble 6006 ms
agentGroup 6072 ms
setup 6072 ms
tearDown 6072 ms
tearDown 6178 ms
agentGroupWithHashUris 6179 ms
setup 6179 ms
tearDown 6292 ms
agentSingle 6293 ms
setup 6293 ms
tearDown 6342 ms
allAuthenticatedAgents 6343 ms
setup 6343 ms
resourceSingle 6393 ms
setup 6393 ms
tearDown 6393 ms
tearDown 6498 ms
org.fcrepo.spec.testsuite.crud.StateToken
badStateTokenOnPatchWhenStateTokensSupported 6499 ms
setup 6499 ms
setup 6526 ms
tearDown 6526 ms
badStateTokenOnPutWhenStateTokensSupported 6527 ms
tearDown 6553 ms
goodStateTokenOnPatchWhenStateTokensSupported 6554 ms
setup 6554 ms
goodStateTokenOnPutSucceedsWhenStateTokensSupported 6580 ms
setup 6580 ms
tearDown 6580 ms
tearDown 6627 ms
org.fcrepo.spec.testsuite.authz.WebACDefaultACLs
aclInheritanceMustUseLdpContainmentRelationships 6628 ms
setup 6628 ms
tearDown 6941 ms
org.fcrepo.spec.testsuite.versioning.LdprvHttpGet
ldpvGetMustReturnHeaderOriginalTypeLink 6942 ms
setup 6942 ms
ldpvGetMustReturnHeaderTimeGateTypeLink 6977 ms
setup 6977 ms
tearDown 6977 ms
ldpvGetMustReturnOriginalResourceLink 7027 ms
setup 7027 ms
tearDown 7027 ms
tearDown 7088 ms
ldpvGetMustReturnTimeGateTypeLink 7089 ms
setup 7089 ms
ldpvGetMustReturnTimeMapLink 7121 ms
setup 7121 ms
tearDown 7121 ms
tearDown 7148 ms
ldpvGetMustReturnVaryHeader 7149 ms
setup 7149 ms
setup 7177 ms
shouldReturn302WhenLdprmFromTimeGate 7177 ms
tearDown 7177 ms
org.fcrepo.spec.testsuite.authz.WebACAccessToClass
accessToClassMustGiveAccessToBinary 7252 ms
setup 7252 ms
org.fcrepo.spec.testsuite.versioning.LdprvHttpGet
tearDown 7252 ms
org.fcrepo.spec.testsuite.authz.WebACAccessToClass
accessToClassMustGiveAccessToContainer 7325 ms
setup 7325 ms
tearDown 7325 ms
org.fcrepo.spec.testsuite.versioning.LdprvHttpPut
ldpnrvMustSupportPUT 7399 ms
setup 7399 ms
org.fcrepo.spec.testsuite.authz.WebACAccessToClass
tearDown 7399 ms
org.fcrepo.spec.testsuite.versioning.LdprvHttpPut
setup 7423 ms
tearDown 7423 ms
ldpnrvMustSupportPUTForExistingResources 7424 ms
ldprvMustSupportPUT 7447 ms
setup 7447 ms
tearDown 7447 ms
ldprvMustSupportPUTForExistingResources 7470 ms
setup 7470 ms
tearDown 7470 ms
org.fcrepo.spec.testsuite.authz.WebACCrossDomain
rejectRemoteAclConstraint 7493 ms
setup 7493 ms
org.fcrepo.spec.testsuite.versioning.LdprvHttpPut
tearDown 7493 ms
org.fcrepo.spec.testsuite.authz.WebACCrossDomain
tearDown 7528 ms
rejectRemoteAclStatus 7529 ms
setup 7529 ms
rejectRemoteGroupConstraint 7535 ms
setup 7535 ms
tearDown 7535 ms
tearDown 7578 ms
rejectRemoteGroupStatus 7579 ms
setup 7579 ms
org.fcrepo.spec.testsuite.versioning.LdprmHttpGet
ldpnrmMustHaveCorrectTimeGate 7624 ms
setup 7624 ms
org.fcrepo.spec.testsuite.authz.WebACCrossDomain
tearDown 7624 ms
org.fcrepo.spec.testsuite.versioning.LdprmHttpGet
ldpnrmMustHaveMementoLinkHeader 7690 ms
setup 7690 ms
tearDown 7690 ms
ldpnrmMustSupportGet 7761 ms
setup 7761 ms
tearDown 7761 ms
ldprmMustHaveCorrectTimeGate 7827 ms
setup 7827 ms
tearDown 7827 ms
ldprmMustHaveMementoLinkHeader 7885 ms
setup 7885 ms
tearDown 7885 ms
ldprmMustSupportGet 7944 ms
setup 7944 ms
tearDown 7944 ms
org.fcrepo.spec.testsuite.event.NotificationTest
beforeClass 8007 ms
org.fcrepo.spec.testsuite.versioning.LdprmHttpGet
tearDown 8007 ms
org.fcrepo.spec.testsuite.event.NotificationTest
setup 8172 ms
testCatchMessage 8172 ms
setup 8720 ms
tearDown 8720 ms
testEventSerialization 8720 ms
closeConnection 9308 ms
tearDown 9308 ms
org.fcrepo.spec.testsuite.versioning.LdprmHttpDelete
ldprmMustSupportDeleteIfAdvertised 9309 ms
setup 9309 ms
tearDown 9370 ms
org.fcrepo.spec.testsuite.versioning.LdprmHttpOptions
ldprmMustNotSupportPatch 9371 ms
setup 9371 ms
ldprmMustNotSupportPost 9436 ms
setup 9436 ms
tearDown 9436 ms
tearDown 9506 ms
ldprmMustNotSupportPut 9507 ms
setup 9507 ms
tearDown 9572 ms
ldprmMustSupportOptions 9573 ms
setup 9573 ms
tearDown 9635 ms
ldprmOptionsMustSupportGetHeadAndOptions 9636 ms
setup 9636 ms
org.fcrepo.spec.testsuite.versioning.LdpcvHttpGet
ldpcvMustHaveContainerLinkHeader 9701 ms
setup 9701 ms
org.fcrepo.spec.testsuite.versioning.LdprmHttpOptions
tearDown 9701 ms
org.fcrepo.spec.testsuite.versioning.LdpcvHttpGet
tearDown 9737 ms
ldpcvMustHaveTimeMapLinkHeader 9738 ms
setup 9738 ms
setup 9771 ms
tearDown 9771 ms
ldpcvMustIncludeAcceptPatchIfPatchAllowed 9772 ms
ldpcvMustIncludeAcceptPostIfPostAllowed 9808 ms
setup 9808 ms
tearDown 9808 ms
tearDown 9843 ms
ldpcvMustRespondToGetWithApplicationLinkAcceptHeader 9844 ms
setup 9844 ms
ldpcvMustSupportGet 9879 ms
setup 9879 ms
tearDown 9879 ms
lpcvMustIncludeAllowHeader 9914 ms
setup 9914 ms
tearDown 9914 ms
org.fcrepo.spec.testsuite.versioning.LdpcvHttpPost
ldpcvDoesNotSupportPost 9950 ms
setup 9950 ms
org.fcrepo.spec.testsuite.versioning.LdpcvHttpGet
tearDown 9950 ms
org.fcrepo.spec.testsuite.versioning.LdpcvHttpPost
tearDown 9993 ms
postToldpcvOfLdpnrWithoutMementoDatetimeMustIgnoreBody 9994 ms
setup 9994 ms
postToldpcvOfLdprsWithoutMementoDatetimeMustIgnoreBody 10033 ms
setup 10033 ms
tearDown 10033 ms
tearDown 10067 ms